[Webtest] FW: Fragen zu Webtest

Dierk König Dierk.Koenig@canoo.com
Wed, 6 Mar 2002 21:39:33 +0100


This is a multi-part message in MIME format.

------=_NextPart_000_0000_01C1C557.6779B2A0
Content-Type: text/plain;
	charset="iso-8859-1"
Content-Transfer-Encoding: 8bit

forwarded to the mailing list at webtest@lists.canoo.com

-----Original Message-----
From: andreas.bucksteeg@hybris.de [mailto:andreas.bucksteeg@hybris.de]
Sent: Dienstag, 5. März 2002 18:17
To: marc.domenig@canoo.com
Subject: Fragen zu Webtest

Hallo,

ich bin heute auf der Suche nach Tools für Automatiches Test für
Web-Applikationen
auf WebTest gestossen. Beim evaluieren sind zwei Probleme aufgetreten,
vielleicht
können Sie mir weiterhelfen, da ich Webtest ansonsten sehr interessant
finde.

Selftest:
=========
Nach dem Start des Selftest über ant -buildfile selfTest.xml liefert ANT
folgenden
Fehlermeldung:

--------------

...

failIfBadPath:

applySingle:
    [style] Processing
C:\data\Projects\webTest\doc\samples\WebTestReport.xml to
 C:\data\Projects\webTest\doc\samples\TestResultOverview.html
    [style] Loading stylesheet
C:\data\Projects\webTest\doc\samples\WebTestRepor
t.xsl
    [style] Failed to read stylesheet
C:\data\Projects\webTest\doc\samples\WebTe
stReport.xsl
    [style] Failed to process
C:\data\Projects\webTest\doc\samples\WebTestReport
.xml

BUILD FAILED

C:\data\Projects\webTest\doc\samples\ApplyXSL.xml:47:
javax.xml.transform.Transf
ormerConfigurationException: javax.xml.transform.TransformerException:
javax.xml
.transform.TransformerException: xsl:import is not allowed in this position
in t
he stylesheet!

Total time: 7 seconds
--------------

Ich habe eine Property-Datei server.properties ins Root-Verzeichnis
<webtest> gelegt,
sie ist als Attachement angefügt. Das selftest.war ist in Orion 1.5.4 unter
http://burlington/selftest freigegeben. Haben Sie eine Ahnung, wie ich
diesen Fehler
beheben kann?


Komplilieren:
=============
Beim Komplieren / Build des Source-Pakets bekomme ich den folgenden
Kompilierungsfehler.
Ich habe das src.zip heute von Ihrer Webseite gedownloaded. Können Sie mir
sagen,
wie ich zu einer komplierenden Version komme?

clean:
     [echo] jar is not up to date: needs rebuild
    [mkdir] Created dir: C:\data\Projects\webTest\build
    [mkdir] Created dir: C:\data\Projects\webTest\deploy
    [mkdir] Created dir: C:\data\Projects\webTest\deploy\lib

compile:
    [mkdir] Created dir: C:\data\Projects\webTest\build\classes
    [javac] Compiling 97 source files to
C:\data\Projects\webTest\build\classes
    [javac]
C:\data\Projects\webTest\src\com\canoo\webtest\steps\VerifyCheckboxT
est.java:139: <anonymous com.canoo.webtest.steps.VerifyCheckboxTest$1>
should be
 declared abstract; it does not define
isSupported(java.lang.String,java.lang.St
ring) in
    [javac]                 public boolean supports(String s, String s1) {
    [javac]                                ^
    [javac] 1 error

BUILD FAILED




Schöne Grüße in die Schweiz,

Andreas Bucksteeg

--
 hybris GmbH           |  Andreas Bucksteeg
 Frankfurter Ring 162  |  Vice President Professional Service
 D-80807 München       |
                       |
 t +49(0)89 89065-0    |  andreas.bucksteeg@hybris.de
 f +49(0)89 89065-555  |  www.hybris.de

Besuchen Sie uns auf der CeBIT,
13.-20.03.2002 in Hannover,
Halle 7, Stand C05.



------=_NextPart_000_0000_01C1C557.6779B2A0
Content-Type: application/octet-stream;
	name="server.properties"
Content-Transfer-Encoding: 7bit
Content-Disposition: attachment;
	filename="server.properties"

host=burlington
port=80
protocol=http
basepath=/selftest
resultpath=temp/
resultfile=result.txt
haltonfailure=true


------=_NextPart_000_0000_01C1C557.6779B2A0--