[Webtest] FW: Fragen zu Webtest

Dierk König Dierk.Koenig@canoo.com
Wed, 6 Mar 2002 22:58:50 +0100


Hallo,

Für die normale Verwendung von WebTest benötigen Sie den selftest.xml
nicht (vgl. Install page), sondern nur, wenn sie den Code verändern wollen.

In dem Fall ist eine sichere Rückfalllösung, einen cvs update aus dem
repository mit tag LAST_BUILD zu machen. Das ist der Zustand mit dem auf
dem Server zuletzt automatisch kompiliert wurde.


> -----Original Message-----
> From: webtest-admin@lists.canoo.com
> [mailto:webtest-admin@lists.canoo.com]On Behalf Of Dierk König
> Sent: Mittwoch, 6. März 2002 21:40
> To: Webtest@Lists. Canoo. Com
> Cc: Andreas. Bucksteeg@Hybris. De
> Subject: [Webtest] FW: Fragen zu Webtest
..
> C:\data\Projects\webTest\doc\samples\WebTestRepor
> t.xsl
>     [style] Failed to read stylesheet
> C:\data\Projects\webTest\doc\samples\WebTe
> stReport.xsl
>     [style] Failed to process
> C:\data\Projects\webTest\doc\samples\WebTestReport
> .xml
>
> BUILD FAILED
>
> C:\data\Projects\webTest\doc\samples\ApplyXSL.xml:47:
> javax.xml.transform.Transf
> ormerConfigurationException: javax.xml.transform.TransformerException:
> javax.xml
> .transform.TransformerException: xsl:import is not allowed in
> this position
> in t
> he stylesheet!

Hier ist ein Fehler in der Datei
C:\data\Projects\webTest\doc\samples\WebTestReport.xsl.
Haben Sie diese verändert?

Sie bezieht sich übrigens lediglich auf die Formatierung der Reports und hat
keine
funktionale Bedeutung.

> Ich habe eine Property-Datei server.properties ins Root-Verzeichnis
> <webtest> gelegt,
..

Die Datei server.properties hat keinen Einfluss auf den obigen Fehler.
Der selftest ist gelaufen und sie werden das result im resultdir finden.

> C:\data\Projects\webTest\src\com\canoo\webtest\steps\VerifyCheckboxT
> est.java:139: <anonymous com.canoo.webtest.steps.VerifyCheckboxTest$1>
> should be
>  declared abstract; it does not define
> isSupported(java.lang.String,java.lang.St
> ring) in
>     [javac]                 public boolean supports(String s, String s1) {
>     [javac]                                ^
>     [javac] 1 error
>
> BUILD FAILED

Sie haben eine ältere Version erwischt, die Probleme mit verschiedenen
Implementierungen von "Node" in den verwendeten libs hatte.

Verwenden Sie am besten den letzten Build.

Wir sind gerade dabei, die libs neu zu ordnen. Wahrscheinlich sind wir
morgen, Do 7.3. so weit.

gruss
Dierk König