[Webtest] Indexoutofbounds error

Dierk Koenig webtest@lists.canoo.com
Fri, 21 May 2004 12:33:24 +0200


This is a multi-part message in MIME format.

------=_NextPart_000_0023_01C43F2F.CF651EA0
Content-Type: text/plain;
	charset="us-ascii"
Content-Transfer-Encoding: 7bit

>From the stacktrace it seems that HttpUnit has problems executing some
JavaScript on your page.

For validation, you can try to write an HttpUnit test directly.

cheers
Mittie
  -----Original Message-----
  From: webtest-admin@lists.canoo.com
[mailto:webtest-admin@lists.canoo.com]On Behalf Of Doug Burco
  Sent: Donnerstag, 20. Mai 2004 18:27
  To: WebTest@lists.canoo.com
  Subject: [Webtest] Indexoutofbounds error


  I get this stack trace when I run almost any test step that demands a new
response.  Invoking pages directly does not seem to produce the same
problem.  My build is #427.  Does anyone out there have some insight into
this issue?





  [testSpec] java.lang.StringIndexOutOfBoundsException: String index out of
range: -1

   [testSpec]     at
org.mozilla.javascript.WrappedException.<init>(WrappedException.java:56)

   [testSpec]     at
org.mozilla.javascript.WrappedException.wrapException(WrappedException.java:
111)

   [testSpec]     at
org.mozilla.javascript.ScriptableObject.setBySetter(ScriptableObject.java:29
6)

   [testSpec]     at
org.mozilla.javascript.ScriptableObject.put(ScriptableObject.java:256)

   [testSpec]     at
com.meterware.httpunit.javascript.JavaScript$JavaScriptEngine.put(JavaScript
.java:263)

   [testSpec]     at
org.mozilla.javascript.ScriptableObject.putProperty(ScriptableObject.java:14
76)

   [testSpec]     at
org.mozilla.javascript.ScriptRuntime.setProp(ScriptRuntime.java:844)

   [testSpec]     at
org.mozilla.javascript.Interpreter.interpret(Interpreter.java:2056)

   [testSpec]     at
org.mozilla.javascript.InterpretedScript.call(InterpretedScript.java:62)

   [testSpec]     at
org.mozilla.javascript.InterpretedScript.exec(InterpretedScript.java:55)

   [testSpec]     at
org.mozilla.javascript.Context.evaluateString(Context.java:781)

   [testSpec]     at
com.meterware.httpunit.javascript.JavaScript$JavaScriptEngine.executeScript(
JavaScript.java:122)

   [testSpec]     at
com.meterware.httpunit.scripting.ScriptableDelegate.runScript(ScriptableDele
gate.java:64)

   [testSpec]     at
com.meterware.httpunit.ParsedHTML.interpretScriptElement(ParsedHTML.java:275
)

   [testSpec]     at
com.meterware.httpunit.ParsedHTML.access$600(ParsedHTML.java:37)

   [testSpec]     at
com.meterware.httpunit.ParsedHTML$ScriptFactory.recordElement(ParsedHTML.jav
a:404)

   [testSpec]     at
com.meterware.httpunit.ParsedHTML$2.processElement(ParsedHTML.java:556)

   [testSpec]     at
com.meterware.httpunit.NodeUtils$PreOrderTraversal.perform(NodeUtils.java:16
9)

   [testSpec]     at
com.meterware.httpunit.ParsedHTML.loadElements(ParsedHTML.java:566)

   [testSpec]     at
com.meterware.httpunit.ParsedHTML.getForms(ParsedHTML.java:101)

   [testSpec]     at
com.meterware.httpunit.WebResponse$Scriptable.load(WebResponse.java:611)

   [testSpec]     at
com.meterware.httpunit.javascript.JavaScript$Window.initialize(JavaScript.ja
va:424)

   [testSpec]     at
com.meterware.httpunit.javascript.JavaScript.run(JavaScript.java:80)

   [testSpec]     at
com.meterware.httpunit.javascript.JavaScriptEngineFactory.associate(JavaScri
ptEngineFactory.java:46)

   [testSpec]     at
com.meterware.httpunit.RequestContext.runScripts(RequestContext.java:44)

   [testSpec]     at
com.meterware.httpunit.WebWindow.getResponse(WebWindow.java:119)

   [testSpec]     at
com.meterware.httpunit.WebClient.getResponse(WebClient.java:112)

   [testSpec]     at
com.canoo.webtest.steps.verify.VerifyLinks.visit(VerifyLinks.java:134)

   [testSpec]     at
com.canoo.webtest.steps.verify.VerifyLinks.getVisits(VerifyLinks.java:109)

   [testSpec]     at
com.canoo.webtest.steps.verify.VerifyLinks.checkVisits(VerifyLinks.java:44)

   [testSpec]     at
com.canoo.webtest.steps.verify.VerifyLinks.doExecute(VerifyLinks.java:36)

   [testSpec]     at com.canoo.webtest.steps.Step.execute(Step.java:99)

   [testSpec]     at
com.canoo.webtest.engine.Engine.executeSteps(Engine.java:26)

   [testSpec]     at
com.canoo.webtest.ant.TestSpecificationTask.execute(TestSpecificationTask.ja
va:68)

   [testSpec]     at
org.apache.tools.ant.UnknownElement.execute(UnknownElement.java:193)

   [testSpec]     at org.apache.tools.ant.Task.perform(Task.java:341)

   [testSpec]     at org.apache.tools.ant.Target.execute(Target.java:309)

   [testSpec]     at
org.apache.tools.ant.Target.performTasks(Target.java:336)

   [testSpec]     at
org.apache.tools.ant.Project.executeTarget(Project.java:1339)

   [testSpec]     at
org.apache.tools.ant.Project.executeTargets(Project.java:1255)

   [testSpec]     at org.apache.tools.ant.Main.runBuild(Main.java:609)

   [testSpec]     at org.apache.tools.ant.Main.start(Main.java:196)

   [testSpec]     at org.apache.tools.ant.Main.main(Main.java:235)



  BUILD FAILED

  file:/home/dburco/testTools/CanooWT/doc/samples/em_full.xml:48: Test
failed.

  Exception raised: com.canoo.webtest.engine.StepExecutionException:
Unexpected exception caught: java.lang.RuntimeException: Script '/* Set a
cookie to be sure that one exists. */

  document.cookie = 'killme' + escape('nothing');



  Doug Burco

  Quality Assurance

  PAR3 Communications

  Tel: 206.902.3985

  doug.burco@par3.com





------=_NextPart_000_0023_01C43F2F.CF651EA0
Content-Type: text/html;
	charset="us-ascii"
Content-Transfer-Encoding: quoted-printable

<!DOCTYPE HTML PUBLIC "-//W3C//DTD HTML 4.0 Transitional//EN">
<HTML><HEAD>
<META http-equiv=3DContent-Type content=3D"text/html; =
charset=3Dus-ascii">
<META content=3D"MSHTML 6.00.2800.1400" name=3DGENERATOR>
<STYLE>@page Section1 {size: 8.5in 11.0in; margin: 1.0in 1.25in 1.0in =
1.25in; }
P.MsoNormal {
	FONT-SIZE: 12pt; MARGIN: 0in 0in 0pt; FONT-FAMILY: "Times New Roman"
}
LI.MsoNormal {
	FONT-SIZE: 12pt; MARGIN: 0in 0in 0pt; FONT-FAMILY: "Times New Roman"
}
DIV.MsoNormal {
	FONT-SIZE: 12pt; MARGIN: 0in 0in 0pt; FONT-FAMILY: "Times New Roman"
}
A:link {
	COLOR: blue; TEXT-DECORATION: underline
}
SPAN.MsoHyperlink {
	COLOR: blue; TEXT-DECORATION: underline
}
A:visited {
	COLOR: purple; TEXT-DECORATION: underline
}
SPAN.MsoHyperlinkFollowed {
	COLOR: purple; TEXT-DECORATION: underline
}
SPAN.EmailStyle17 {
	COLOR: windowtext; FONT-FAMILY: Arial
}
DIV.Section1 {
	page: Section1
}
</STYLE>
</HEAD>
<BODY lang=3DEN-US vLink=3Dpurple link=3Dblue>
<DIV><SPAN class=3D709401910-21052004><FONT face=3DArial color=3D#0000ff =
size=3D2>From=20
the stacktrace it seems that HttpUnit has problems executing some =
JavaScript on=20
your page.</FONT></SPAN></DIV>
<DIV><SPAN class=3D709401910-21052004><FONT face=3DArial color=3D#0000ff =

size=3D2></FONT></SPAN>&nbsp;</DIV>
<DIV><SPAN class=3D709401910-21052004><FONT face=3DArial color=3D#0000ff =
size=3D2>For=20
validation, you can try to write an HttpUnit test =
directly.</FONT></SPAN></DIV>
<DIV><SPAN class=3D709401910-21052004><FONT face=3DArial color=3D#0000ff =

size=3D2></FONT></SPAN>&nbsp;</DIV>
<DIV><SPAN class=3D709401910-21052004><FONT face=3DArial color=3D#0000ff =

size=3D2>cheers</FONT></SPAN></DIV>
<DIV><SPAN class=3D709401910-21052004><FONT face=3DArial color=3D#0000ff =

size=3D2>Mittie</FONT></SPAN></DIV>
<BLOCKQUOTE dir=3Dltr=20
style=3D"PADDING-LEFT: 5px; MARGIN-LEFT: 5px; BORDER-LEFT: #0000ff 2px =
solid; MARGIN-RIGHT: 0px">
  <DIV class=3DOutlookMessageHeader dir=3Dltr align=3Dleft><FONT =
face=3DTahoma=20
  size=3D2>-----Original Message-----<BR><B>From:</B>=20
  webtest-admin@lists.canoo.com =
[mailto:webtest-admin@lists.canoo.com]<B>On=20
  Behalf Of </B>Doug Burco<BR><B>Sent:</B> Donnerstag, 20. Mai 2004=20
  18:27<BR><B>To:</B> WebTest@lists.canoo.com<BR><B>Subject:</B> =
[Webtest]=20
  Indexoutofbounds error<BR><BR></FONT></DIV>
  <DIV class=3DSection1>
  <P class=3DMsoNormal><FONT face=3DArial size=3D2><SPAN=20
  style=3D"FONT-SIZE: 10pt; FONT-FAMILY: Arial">I get this stack trace =
when I run=20
  almost any test step that demands a new response.&nbsp; Invoking pages =

  directly does not seem to produce the same problem.&nbsp; My build is=20
  #427.&nbsp; Does anyone out there have some insight into this=20
  issue?</SPAN></FONT></P>
  <P class=3DMsoNormal><FONT face=3DArial size=3D2><SPAN=20
  style=3D"FONT-SIZE: 10pt; FONT-FAMILY: Arial"></SPAN></FONT>&nbsp;</P>
  <P class=3DMsoNormal><FONT face=3DArial size=3D2><SPAN=20
  style=3D"FONT-SIZE: 10pt; FONT-FAMILY: Arial"></SPAN></FONT>&nbsp;</P>
  <P class=3DMsoNormal><FONT face=3DArial size=3D2><SPAN=20
  style=3D"FONT-SIZE: 10pt; FONT-FAMILY: Arial">[testSpec]=20
  java.lang.StringIndexOutOfBoundsException: String index out of range:=20
  -1</SPAN></FONT></P>
  <P class=3DMsoNormal><FONT face=3DArial size=3D2><SPAN=20
  style=3D"FONT-SIZE: 10pt; FONT-FAMILY: =
Arial">&nbsp;[testSpec]&nbsp;&nbsp;&nbsp;&nbsp;=20
  at=20
  =
org.mozilla.javascript.WrappedException.&lt;init&gt;(WrappedException.jav=
a:56)</SPAN></FONT></P>
  <P class=3DMsoNormal><FONT face=3DArial size=3D2><SPAN=20
  style=3D"FONT-SIZE: 10pt; FONT-FAMILY: =
Arial">&nbsp;[testSpec]&nbsp;&nbsp;&nbsp;&nbsp;=20
  at=20
  =
org.mozilla.javascript.WrappedException.wrapException(WrappedException.ja=
va:111)</SPAN></FONT></P>
  <P class=3DMsoNormal><FONT face=3DArial size=3D2><SPAN=20
  style=3D"FONT-SIZE: 10pt; FONT-FAMILY: =
Arial">&nbsp;[testSpec]&nbsp;&nbsp;&nbsp;&nbsp;=20
  at=20
  =
org.mozilla.javascript.ScriptableObject.setBySetter(ScriptableObject.java=
:296)</SPAN></FONT></P>
  <P class=3DMsoNormal><FONT face=3DArial size=3D2><SPAN=20
  style=3D"FONT-SIZE: 10pt; FONT-FAMILY: =
Arial">&nbsp;[testSpec]&nbsp;&nbsp;&nbsp;&nbsp;=20
  at=20
  =
org.mozilla.javascript.ScriptableObject.put(ScriptableObject.java:256)</S=
PAN></FONT></P>
  <P class=3DMsoNormal><FONT face=3DArial size=3D2><SPAN=20
  style=3D"FONT-SIZE: 10pt; FONT-FAMILY: =
Arial">&nbsp;[testSpec]&nbsp;&nbsp;&nbsp;&nbsp;=20
  at=20
  =
com.meterware.httpunit.javascript.JavaScript$JavaScriptEngine.put(JavaScr=
ipt.java:263)</SPAN></FONT></P>
  <P class=3DMsoNormal><FONT face=3DArial size=3D2><SPAN=20
  style=3D"FONT-SIZE: 10pt; FONT-FAMILY: =
Arial">&nbsp;[testSpec]&nbsp;&nbsp;&nbsp;&nbsp;=20
  at=20
  =
org.mozilla.javascript.ScriptableObject.putProperty(ScriptableObject.java=
:1476)</SPAN></FONT></P>
  <P class=3DMsoNormal><FONT face=3DArial size=3D2><SPAN=20
  style=3D"FONT-SIZE: 10pt; FONT-FAMILY: =
Arial">&nbsp;[testSpec]&nbsp;&nbsp;&nbsp;&nbsp;=20
  at=20
  =
org.mozilla.javascript.ScriptRuntime.setProp(ScriptRuntime.java:844)</SPA=
N></FONT></P>
  <P class=3DMsoNormal><FONT face=3DArial size=3D2><SPAN=20
  style=3D"FONT-SIZE: 10pt; FONT-FAMILY: =
Arial">&nbsp;[testSpec]&nbsp;&nbsp;&nbsp;&nbsp;=20
  at=20
  =
org.mozilla.javascript.Interpreter.interpret(Interpreter.java:2056)</SPAN=
></FONT></P>
  <P class=3DMsoNormal><FONT face=3DArial size=3D2><SPAN=20
  style=3D"FONT-SIZE: 10pt; FONT-FAMILY: =
Arial">&nbsp;[testSpec]&nbsp;&nbsp;&nbsp;&nbsp;=20
  at=20
  =
org.mozilla.javascript.InterpretedScript.call(InterpretedScript.java:62)<=
/SPAN></FONT></P>
  <P class=3DMsoNormal><FONT face=3DArial size=3D2><SPAN=20
  style=3D"FONT-SIZE: 10pt; FONT-FAMILY: =
Arial">&nbsp;[testSpec]&nbsp;&nbsp;&nbsp;&nbsp;=20
  at=20
  =
org.mozilla.javascript.InterpretedScript.exec(InterpretedScript.java:55)<=
/SPAN></FONT></P>
  <P class=3DMsoNormal><FONT face=3DArial size=3D2><SPAN=20
  style=3D"FONT-SIZE: 10pt; FONT-FAMILY: =
Arial">&nbsp;[testSpec]&nbsp;&nbsp;&nbsp;&nbsp;=20
  at=20
  =
org.mozilla.javascript.Context.evaluateString(Context.java:781)</SPAN></F=
ONT></P>
  <P class=3DMsoNormal><FONT face=3DArial size=3D2><SPAN=20
  style=3D"FONT-SIZE: 10pt; FONT-FAMILY: =
Arial">&nbsp;[testSpec]&nbsp;&nbsp;&nbsp;&nbsp;=20
  at=20
  =
com.meterware.httpunit.javascript.JavaScript$JavaScriptEngine.executeScri=
pt(JavaScript.java:122)</SPAN></FONT></P>
  <P class=3DMsoNormal><FONT face=3DArial size=3D2><SPAN=20
  style=3D"FONT-SIZE: 10pt; FONT-FAMILY: =
Arial">&nbsp;[testSpec]&nbsp;&nbsp;&nbsp;&nbsp;=20
  at=20
  =
com.meterware.httpunit.scripting.ScriptableDelegate.runScript(ScriptableD=
elegate.java:64)</SPAN></FONT></P>
  <P class=3DMsoNormal><FONT face=3DArial size=3D2><SPAN=20
  style=3D"FONT-SIZE: 10pt; FONT-FAMILY: =
Arial">&nbsp;[testSpec]&nbsp;&nbsp;&nbsp;&nbsp;=20
  at=20
  =
com.meterware.httpunit.ParsedHTML.interpretScriptElement(ParsedHTML.java:=
275)</SPAN></FONT></P>
  <P class=3DMsoNormal><FONT face=3DArial size=3D2><SPAN=20
  style=3D"FONT-SIZE: 10pt; FONT-FAMILY: =
Arial">&nbsp;[testSpec]&nbsp;&nbsp;&nbsp;&nbsp;=20
  at=20
  =
com.meterware.httpunit.ParsedHTML.access$600(ParsedHTML.java:37)</SPAN></=
FONT></P>
  <P class=3DMsoNormal><FONT face=3DArial size=3D2><SPAN=20
  style=3D"FONT-SIZE: 10pt; FONT-FAMILY: =
Arial">&nbsp;[testSpec]&nbsp;&nbsp;&nbsp;&nbsp;=20
  at=20
  =
com.meterware.httpunit.ParsedHTML$ScriptFactory.recordElement(ParsedHTML.=
java:404)</SPAN></FONT></P>
  <P class=3DMsoNormal><FONT face=3DArial size=3D2><SPAN=20
  style=3D"FONT-SIZE: 10pt; FONT-FAMILY: =
Arial">&nbsp;[testSpec]&nbsp;&nbsp;&nbsp;&nbsp;=20
  at=20
  =
com.meterware.httpunit.ParsedHTML$2.processElement(ParsedHTML.java:556)</=
SPAN></FONT></P>
  <P class=3DMsoNormal><FONT face=3DArial size=3D2><SPAN=20
  style=3D"FONT-SIZE: 10pt; FONT-FAMILY: =
Arial">&nbsp;[testSpec]&nbsp;&nbsp;&nbsp;&nbsp;=20
  at=20
  =
com.meterware.httpunit.NodeUtils$PreOrderTraversal.perform(NodeUtils.java=
:169)</SPAN></FONT></P>
  <P class=3DMsoNormal><FONT face=3DArial size=3D2><SPAN=20
  style=3D"FONT-SIZE: 10pt; FONT-FAMILY: =
Arial">&nbsp;[testSpec]&nbsp;&nbsp;&nbsp;&nbsp;=20
  at=20
  =
com.meterware.httpunit.ParsedHTML.loadElements(ParsedHTML.java:566)</SPAN=
></FONT></P>
  <P class=3DMsoNormal><FONT face=3DArial size=3D2><SPAN=20
  style=3D"FONT-SIZE: 10pt; FONT-FAMILY: =
Arial">&nbsp;[testSpec]&nbsp;&nbsp;&nbsp;&nbsp;=20
  at=20
  =
com.meterware.httpunit.ParsedHTML.getForms(ParsedHTML.java:101)</SPAN></F=
ONT></P>
  <P class=3DMsoNormal><FONT face=3DArial size=3D2><SPAN=20
  style=3D"FONT-SIZE: 10pt; FONT-FAMILY: =
Arial">&nbsp;[testSpec]&nbsp;&nbsp;&nbsp;&nbsp;=20
  at=20
  =
com.meterware.httpunit.WebResponse$Scriptable.load(WebResponse.java:611)<=
/SPAN></FONT></P>
  <P class=3DMsoNormal><FONT face=3DArial size=3D2><SPAN=20
  style=3D"FONT-SIZE: 10pt; FONT-FAMILY: =
Arial">&nbsp;[testSpec]&nbsp;&nbsp;&nbsp;&nbsp;=20
  at=20
  =
com.meterware.httpunit.javascript.JavaScript$Window.initialize(JavaScript=
.java:424)</SPAN></FONT></P>
  <P class=3DMsoNormal><FONT face=3DArial size=3D2><SPAN=20
  style=3D"FONT-SIZE: 10pt; FONT-FAMILY: =
Arial">&nbsp;[testSpec]&nbsp;&nbsp;&nbsp;&nbsp;=20
  at=20
  =
com.meterware.httpunit.javascript.JavaScript.run(JavaScript.java:80)</SPA=
N></FONT></P>
  <P class=3DMsoNormal><FONT face=3DArial size=3D2><SPAN=20
  style=3D"FONT-SIZE: 10pt; FONT-FAMILY: =
Arial">&nbsp;[testSpec]&nbsp;&nbsp;&nbsp;&nbsp;=20
  at=20
  =
com.meterware.httpunit.javascript.JavaScriptEngineFactory.associate(JavaS=
criptEngineFactory.java:46)</SPAN></FONT></P>
  <P class=3DMsoNormal><FONT face=3DArial size=3D2><SPAN=20
  style=3D"FONT-SIZE: 10pt; FONT-FAMILY: =
Arial">&nbsp;[testSpec]&nbsp;&nbsp;&nbsp;&nbsp;=20
  at=20
  =
com.meterware.httpunit.RequestContext.runScripts(RequestContext.java:44)<=
/SPAN></FONT></P>
  <P class=3DMsoNormal><FONT face=3DArial size=3D2><SPAN=20
  style=3D"FONT-SIZE: 10pt; FONT-FAMILY: =
Arial">&nbsp;[testSpec]&nbsp;&nbsp;&nbsp;&nbsp;=20
  at=20
  =
com.meterware.httpunit.WebWindow.getResponse(WebWindow.java:119)</SPAN></=
FONT></P>
  <P class=3DMsoNormal><FONT face=3DArial size=3D2><SPAN=20
  style=3D"FONT-SIZE: 10pt; FONT-FAMILY: =
Arial">&nbsp;[testSpec]&nbsp;&nbsp;&nbsp;&nbsp;=20
  at=20
  =
com.meterware.httpunit.WebClient.getResponse(WebClient.java:112)</SPAN></=
FONT></P>
  <P class=3DMsoNormal><FONT face=3DArial size=3D2><SPAN=20
  style=3D"FONT-SIZE: 10pt; FONT-FAMILY: =
Arial">&nbsp;[testSpec]&nbsp;&nbsp;&nbsp;&nbsp;=20
  at=20
  =
com.canoo.webtest.steps.verify.VerifyLinks.visit(VerifyLinks.java:134)</S=
PAN></FONT></P>
  <P class=3DMsoNormal><FONT face=3DArial size=3D2><SPAN=20
  style=3D"FONT-SIZE: 10pt; FONT-FAMILY: =
Arial">&nbsp;[testSpec]&nbsp;&nbsp;&nbsp;&nbsp;=20
  at=20
  =
com.canoo.webtest.steps.verify.VerifyLinks.getVisits(VerifyLinks.java:109=
)</SPAN></FONT></P>
  <P class=3DMsoNormal><FONT face=3DArial size=3D2><SPAN=20
  style=3D"FONT-SIZE: 10pt; FONT-FAMILY: =
Arial">&nbsp;[testSpec]&nbsp;&nbsp;&nbsp;&nbsp;=20
  at=20
  =
com.canoo.webtest.steps.verify.VerifyLinks.checkVisits(VerifyLinks.java:4=
4)</SPAN></FONT></P>
  <P class=3DMsoNormal><FONT face=3DArial size=3D2><SPAN=20
  style=3D"FONT-SIZE: 10pt; FONT-FAMILY: =
Arial">&nbsp;[testSpec]&nbsp;&nbsp;&nbsp;&nbsp;=20
  at=20
  =
com.canoo.webtest.steps.verify.VerifyLinks.doExecute(VerifyLinks.java:36)=
</SPAN></FONT></P>
  <P class=3DMsoNormal><FONT face=3DArial size=3D2><SPAN=20
  style=3D"FONT-SIZE: 10pt; FONT-FAMILY: =
Arial">&nbsp;[testSpec]&nbsp;&nbsp;&nbsp;&nbsp;=20
  at =
com.canoo.webtest.steps.Step.execute(Step.java:99)</SPAN></FONT></P>
  <P class=3DMsoNormal><FONT face=3DArial size=3D2><SPAN=20
  style=3D"FONT-SIZE: 10pt; FONT-FAMILY: =
Arial">&nbsp;[testSpec]&nbsp;&nbsp;&nbsp;&nbsp;=20
  at=20
  =
com.canoo.webtest.engine.Engine.executeSteps(Engine.java:26)</SPAN></FONT=
></P>
  <P class=3DMsoNormal><FONT face=3DArial size=3D2><SPAN=20
  style=3D"FONT-SIZE: 10pt; FONT-FAMILY: =
Arial">&nbsp;[testSpec]&nbsp;&nbsp;&nbsp;&nbsp;=20
  at=20
  =
com.canoo.webtest.ant.TestSpecificationTask.execute(TestSpecificationTask=
.java:68)</SPAN></FONT></P>
  <P class=3DMsoNormal><FONT face=3DArial size=3D2><SPAN=20
  style=3D"FONT-SIZE: 10pt; FONT-FAMILY: =
Arial">&nbsp;[testSpec]&nbsp;&nbsp;&nbsp;&nbsp;=20
  at=20
  =
org.apache.tools.ant.UnknownElement.execute(UnknownElement.java:193)</SPA=
N></FONT></P>
  <P class=3DMsoNormal><FONT face=3DArial size=3D2><SPAN=20
  style=3D"FONT-SIZE: 10pt; FONT-FAMILY: =
Arial">&nbsp;[testSpec]&nbsp;&nbsp;&nbsp;&nbsp;=20
  at org.apache.tools.ant.Task.perform(Task.java:341)</SPAN></FONT></P>
  <P class=3DMsoNormal><FONT face=3DArial size=3D2><SPAN=20
  style=3D"FONT-SIZE: 10pt; FONT-FAMILY: =
Arial">&nbsp;[testSpec]&nbsp;&nbsp;&nbsp;&nbsp;=20
  at =
org.apache.tools.ant.Target.execute(Target.java:309)</SPAN></FONT></P>
  <P class=3DMsoNormal><FONT face=3DArial size=3D2><SPAN=20
  style=3D"FONT-SIZE: 10pt; FONT-FAMILY: =
Arial">&nbsp;[testSpec]&nbsp;&nbsp;&nbsp;&nbsp;=20
  at =
org.apache.tools.ant.Target.performTasks(Target.java:336)</SPAN></FONT></=
P>
  <P class=3DMsoNormal><FONT face=3DArial size=3D2><SPAN=20
  style=3D"FONT-SIZE: 10pt; FONT-FAMILY: =
Arial">&nbsp;[testSpec]&nbsp;&nbsp;&nbsp;&nbsp;=20
  at=20
  =
org.apache.tools.ant.Project.executeTarget(Project.java:1339)</SPAN></FON=
T></P>
  <P class=3DMsoNormal><FONT face=3DArial size=3D2><SPAN=20
  style=3D"FONT-SIZE: 10pt; FONT-FAMILY: =
Arial">&nbsp;[testSpec]&nbsp;&nbsp;&nbsp;&nbsp;=20
  at=20
  =
org.apache.tools.ant.Project.executeTargets(Project.java:1255)</SPAN></FO=
NT></P>
  <P class=3DMsoNormal><FONT face=3DArial size=3D2><SPAN=20
  style=3D"FONT-SIZE: 10pt; FONT-FAMILY: =
Arial">&nbsp;[testSpec]&nbsp;&nbsp;&nbsp;&nbsp;=20
  at org.apache.tools.ant.Main.runBuild(Main.java:609)</SPAN></FONT></P>
  <P class=3DMsoNormal><FONT face=3DArial size=3D2><SPAN=20
  style=3D"FONT-SIZE: 10pt; FONT-FAMILY: =
Arial">&nbsp;[testSpec]&nbsp;&nbsp;&nbsp;&nbsp;=20
  at org.apache.tools.ant.Main.start(Main.java:196)</SPAN></FONT></P>
  <P class=3DMsoNormal><FONT face=3DArial size=3D2><SPAN=20
  style=3D"FONT-SIZE: 10pt; FONT-FAMILY: =
Arial">&nbsp;[testSpec]&nbsp;&nbsp;&nbsp;&nbsp;=20
  at org.apache.tools.ant.Main.main(Main.java:235)</SPAN></FONT></P>
  <P class=3DMsoNormal><FONT face=3DArial size=3D2><SPAN=20
  style=3D"FONT-SIZE: 10pt; FONT-FAMILY: Arial"></SPAN></FONT>&nbsp;</P>
  <P class=3DMsoNormal><FONT face=3DArial size=3D2><SPAN=20
  style=3D"FONT-SIZE: 10pt; FONT-FAMILY: Arial">BUILD =
FAILED</SPAN></FONT></P>
  <P class=3DMsoNormal><FONT face=3DArial size=3D2><SPAN=20
  style=3D"FONT-SIZE: 10pt; FONT-FAMILY: =
Arial">file:/home/dburco/testTools/CanooWT/doc/samples/em_full.xml:48:=20
  Test failed.</SPAN></FONT></P>
  <P class=3DMsoNormal><FONT face=3DArial size=3D2><SPAN=20
  style=3D"FONT-SIZE: 10pt; FONT-FAMILY: Arial">Exception raised:=20
  com.canoo.webtest.engine.StepExecutionException: Unexpected exception =
caught:=20
  java.lang.RuntimeException: Script '/* Set a cookie to be sure that =
one=20
  exists. */</SPAN></FONT></P>
  <P class=3DMsoNormal><FONT face=3DArial size=3D2><SPAN=20
  style=3D"FONT-SIZE: 10pt; FONT-FAMILY: Arial">document.cookie =3D =
'killme' +=20
  escape('nothing');</SPAN></FONT></P>
  <P class=3DMsoNormal><FONT face=3DArial size=3D2><SPAN=20
  style=3D"FONT-SIZE: 10pt; FONT-FAMILY: Arial"></SPAN></FONT>&nbsp;</P>
  <P class=3DMsoNormal><FONT face=3DArial size=3D2><SPAN=20
  style=3D"FONT-SIZE: 10pt; FONT-FAMILY: Arial">Doug =
Burco</SPAN></FONT></P>
  <P class=3DMsoNormal><FONT face=3DArial size=3D2><SPAN=20
  style=3D"FONT-SIZE: 10pt; FONT-FAMILY: Arial">Quality=20
Assurance</SPAN></FONT></P>
  <P class=3DMsoNormal><FONT face=3DArial size=3D2><SPAN=20
  style=3D"FONT-SIZE: 10pt; FONT-FAMILY: Arial">PAR3=20
  Communications</SPAN></FONT></P>
  <P class=3DMsoNormal><FONT face=3DArial size=3D2><SPAN=20
  style=3D"FONT-SIZE: 10pt; FONT-FAMILY: Arial">Tel:=20
206.902.3985</SPAN></FONT></P>
  <P class=3DMsoNormal><FONT face=3DArial size=3D2><SPAN=20
  style=3D"FONT-SIZE: 10pt; FONT-FAMILY: Arial"><A=20
  =
href=3D"mailto:doug.burco@par3.com">doug.burco@par3.com</A></SPAN></FONT>=
</P>
  <P class=3DMsoNormal><FONT face=3D"Times New Roman" size=3D3><SPAN=20
  style=3D"FONT-SIZE: 12pt"></SPAN></FONT>&nbsp;</P>
  <P class=3DMsoNormal><FONT face=3D"Times New Roman" size=3D3><SPAN=20
  style=3D"FONT-SIZE: =
12pt"></SPAN></FONT>&nbsp;</P></DIV></BLOCKQUOTE></BODY></HTML>

------=_NextPart_000_0023_01C43F2F.CF651EA0--