[Webtest] (no subject)

sumathi P webtest@lists.canoo.com
18 Jun 2004 09:26:09 -0000


 This is a multipart mime message


--Next_1087550769---0-202.54.124.151-30264
Content-type: text/html;
	charset=iso-8859-1
Content-Transfer-Encoding: quoted-printable
Content-Disposition: inline

<P>=0A&nbsp; <BR>=0AHello , <BR>=0AI'm new to this application . Can any on=
e please guide me through&nbsp; the configuration processes .<BR>=0AI tried=
 by running <BR>=0Aant -buildfile installTest.xml<BR>=0A<BR>=0AI'm getting =
the following exception,<BR>=0A<BR>=0AE:\PreVista\CanooWebTest\doc\samples&=
gt;ant -buildfile installTest.xml<BR>=0ABuildfile: installTest.xml<BR>=0A<B=
R>=0AcheckANT:<BR>=0A<BR>=0AmayPrintANTError:<BR>=0A<BR>=0AcheckWebTest:<BR=
>=0A&nbsp; &nbsp;  [echo] base dir is E:\PreVista\CanooWebTest\doc\samples<=
BR>=0A [testSpec] ERROR (Step.java:333) - Cannot handle unexpected exceptio=
n in step InvokePage at&nbsp; with (stepId=3D&quot;get local file&quot;, ur=
l=3D&quot;E:\PreVista\Cano<BR>=0A [testSpec] java.net.UnknownHostException:=
 E<BR>=0A [testSpec]&nbsp; &nbsp;  at java.net.PlainSocketImpl.connect(Plai=
nSocketImpl.java:153)<BR>=0A [testSpec]&nbsp; &nbsp;  at java.net.Socket.co=
nnect(Socket.java:452)<BR>=0A [testSpec]&nbsp; &nbsp;  at java.net.Socket.c=
onnect(Socket.java:402)<BR>=0A [testSpec]&nbsp; &nbsp;  at sun.net.NetworkC=
lient.doConnect(NetworkClient.java:139)<BR>=0A [testSpec]&nbsp; &nbsp;  at =
sun.net.NetworkClient.openServer(NetworkClient.java:118)<BR>=0A [testSpec]&=
nbsp; &nbsp;  at sun.net.ftp.FtpClient.openServer(FtpClient.java:423)<BR>=
=0A [testSpec]&nbsp; &nbsp;  at sun.net.ftp.FtpClient.&lt;init&gt;(FtpClien=
t.java:692)<BR>=0A [testSpec]&nbsp; &nbsp;  at sun.net.www.protocol.ftp.Ftp=
URLConnection.connect(FtpURLConnection.java:175)<BR>=0A [testSpec]&nbsp; &n=
bsp;  at sun.net.www.protocol.ftp.FtpURLConnection.getInputStream(FtpURLCon=
nection.java:257)<BR>=0A [testSpec]&nbsp; &nbsp;  at com.meterware.httpunit=
.HttpWebResponse.getInputStream(HttpWebResponse.java:68)<BR>=0A [testSpec]&=
nbsp; &nbsp;  at com.meterware.httpunit.HttpWebResponse.&lt;init&gt;(HttpWe=
bResponse.java:61)<BR>=0A [testSpec]&nbsp; &nbsp;  at com.meterware.httpuni=
t.WebConversation.newResponse(WebConversation.java:61)<BR>=0A [testSpec]&nb=
sp; &nbsp;  at com.meterware.httpunit.WebWindow.getResource(WebWindow.java:=
162)<BR>=0A [testSpec]&nbsp; &nbsp;  at com.meterware.httpunit.WebWindow.ge=
tSubframeResponse(WebWindow.java:125)<BR>=0A [testSpec]&nbsp; &nbsp;  at co=
m.meterware.httpunit.WebWindow.getResponse(WebWindow.java:118)<BR>=0A [test=
Spec]&nbsp; &nbsp;  at com.meterware.httpunit.WebWindow.getResponse(WebWind=
ow.java:99)<BR>=0A [testSpec]&nbsp; &nbsp;  at com.meterware.httpunit.WebCl=
ient.getResponse(WebClient.java:86)<BR>=0A [testSpec]&nbsp; &nbsp;  at com.=
canoo.webtest.steps.request.Target.getResponse(Target.java:179)<BR>=0A [tes=
tSpec]&nbsp; &nbsp;  at com.canoo.webtest.steps.request.Target$2.call(Targe=
t.java:156)<BR>=0A [testSpec]&nbsp; &nbsp;  at com.canoo.webtest.steps.requ=
est.Target.protectedGoto(Target.java:106)<BR>=0A [testSpec]&nbsp; &nbsp;  a=
t com.canoo.webtest.steps.request.Target.gotoTarget(Target.java:153)<BR>=0A=
 [testSpec]&nbsp; &nbsp;  at com.canoo.webtest.steps.request.InvokePage.doE=
xecute(InvokePage.java:37)<BR>=0A [testSpec]&nbsp; &nbsp;  at com.canoo.web=
test.steps.Step.execute(Step.java:99)<BR>=0A [testSpec]&nbsp; &nbsp;  at co=
m.canoo.webtest.engine.Engine.executeSteps(Engine.java:26)<BR>=0A [testSpec=
]&nbsp; &nbsp;  at com.canoo.webtest.ant.TestSpecificationTask.execute(Test=
SpecificationTask.java:68)<BR>=0A [testSpec]&nbsp; &nbsp;  at org.apache.to=
ols.ant.UnknownElement.execute(UnknownElement.java:166)<BR>=0A [testSpec]&n=
bsp; &nbsp;  at org.apache.tools.ant.Task.perform(Task.java:317)<BR>=0A [te=
stSpec]&nbsp; &nbsp;  at org.apache.tools.ant.Target.execute(Target.java:30=
9)<BR>=0A [testSpec]&nbsp; &nbsp;  at org.apache.tools.ant.Target.performTa=
sks(Target.java:334)<BR>=0A [testSpec]&nbsp; &nbsp;  at org.apache.tools.an=
t.Project.executeTarget(Project.java:1306)<BR>=0A [testSpec]&nbsp; &nbsp;  =
at org.apache.tools.ant.Project.executeTargets(Project.java:1250)<BR>=0A [t=
estSpec]&nbsp; &nbsp;  at org.apache.tools.ant.Main.runBuild(Main.java:610)=
<BR>=0A [testSpec]&nbsp; &nbsp;  at org.apache.tools.ant.Main.start(Main.ja=
va:196)<BR>=0A [testSpec]&nbsp; &nbsp;  at org.apache.tools.ant.Main.main(M=
ain.java:235)<BR>=0A<BR>=0ABUILD FAILED<BR>=0Afile:E:/PreVista/CanooWebTest=
/doc/samples/installTest.xml:10: Test failed.<BR>=0AException raised: com.c=
anoo.webtest.engine.StepExecutionException: Unexpected exception caught: ja=
va.net.UnknownHostException: E, Step: InvokePage<BR>=0A&nbsp; &nbsp; &nbsp;=
 &nbsp; at com.canoo.webtest.steps.Step.handleUnexpectedException(Step.java=
:334)<BR>=0A&nbsp; &nbsp; &nbsp; &nbsp; at com.canoo.webtest.steps.request.=
Target.protectedGoto(Target.java:115)<BR>=0A&nbsp; &nbsp; &nbsp; &nbsp; at =
com.canoo.webtest.steps.request.Target.gotoTarget(Target.java:153)<BR>=0A&n=
bsp; &nbsp; &nbsp; &nbsp; at com.canoo.webtest.steps.request.InvokePage.doE=
xecute(InvokePage.java:37)<BR>=0A&nbsp; &nbsp; &nbsp; &nbsp; at com.canoo.w=
ebtest.steps.Step.execute(Step.java:99)<BR>=0A&nbsp; &nbsp; &nbsp; &nbsp; a=
t com.canoo.webtest.engine.Engine.executeSteps(Engine.java:26)<BR>=0A&nbsp;=
 &nbsp; &nbsp; &nbsp; at com.canoo.webtest.ant.TestSpecificationTask.execut=
e(TestSpecificationTask.java:68)<BR>=0A&nbsp; &nbsp; &nbsp; &nbsp; at org.a=
pache.tools.ant.UnknownElement.execute(UnknownElement.java:166)<BR>=0A&nbsp=
; &nbsp; &nbsp; &nbsp; at org.apache.tools.ant.Task.perform(Task.java:317)<=
BR>=0A&nbsp; &nbsp; &nbsp; &nbsp; at org.apache.tools.ant.Target.execute(Ta=
rget.java:309)<BR>=0A&nbsp; &nbsp; &nbsp; &nbsp; at org.apache.tools.ant.Ta=
rget.performTasks(Target.java:334)<BR>=0A&nbsp; &nbsp; &nbsp; &nbsp; at org=
.apache.tools.ant.Project.executeTarget(Project.java:1306)<BR>=0A&nbsp; &nb=
sp; &nbsp; &nbsp; at org.apache.tools.ant.Project.executeTargets(Project.ja=
va:1250)<BR>=0A&nbsp; &nbsp; &nbsp; &nbsp; at org.apache.tools.ant.Main.run=
Build(Main.java:610)<BR>=0A&nbsp; &nbsp; &nbsp; &nbsp; at org.apache.tools.=
ant.Main.start(Main.java:196)<BR>=0A&nbsp; &nbsp; &nbsp; &nbsp; at org.apac=
he.tools.ant.Main.main(Main.java:235)<BR>=0A<BR>=0A<BR>=0ATotal time: 26 se=
conds<BR>=0AE:\PreVista\CanooWebTest\doc\samples&gt;ant -buildfile installT=
est.xml<BR>=0A<BR>=0Aplease tell me what cud be the problem=0A</P>=0A=0A=0A=
<br><br>=0A<A target=3D"_blank" HREF=3D"http://clients.rediff.com/signature=
/track_sig.asp"><IMG SRC=3D"http://ads.rediff.com/RealMedia/ads/adstream_nx=
.cgi/www.rediffmail.com/inbox.htm@Bottom" BORDER=3D0 VSPACE=3D0 HSPACE=3D0>=
</a>=0A
--Next_1087550769---0-202.54.124.151-30264
Content-type: text/plain;
	charset=iso-8859-1
Content-Transfer-Encoding: quoted-printable
Content-Disposition: inline

 =A0=0AHello , =0AI'm new to this application . Can any one please guide me=
 through  the configuration processes .=0AI tried by running =0Aant -buildf=
ile installTest.xml=0A=0AI'm getting the following exception,=0A=0AE:\PreVi=
sta\CanooWebTest\doc\samples>ant -buildfile installTest.xml=0ABuildfile: in=
stallTest.xml=0A=0AcheckANT:=0A=0AmayPrintANTError:=0A=0AcheckWebTest:=0A  =
   [echo] base dir is E:\PreVista\CanooWebTest\doc\samples=0A [testSpec] ER=
ROR (Step.java:333) - Cannot handle unexpected exception in step InvokePage=
 at  with (stepId=3D"get local file", url=3D"E:\PreVista\Cano=0A [testSpec]=
 java.net.UnknownHostException: E=0A [testSpec]     at java.net.PlainSocket=
Impl.connect(PlainSocketImpl.java:153)=0A [testSpec]     at java.net.Socket=
.connect(Socket.java:452)=0A [testSpec]     at java.net.Socket.connect(Sock=
et.java:402)=0A [testSpec]     at sun.net.NetworkClient.doConnect(NetworkCl=
ient.java:139)=0A [testSpec]     at sun.net.NetworkClient.openServer(Networ=
kClient.java:118)=0A [testSpec]     at sun.net.ftp.FtpClient.openServer(Ftp=
Client.java:423)=0A [testSpec]     at sun.net.ftp.FtpClient.<init>(FtpClien=
t.java:692)=0A [testSpec]     at sun.net.www.protocol.ftp.FtpURLConnection.=
connect(FtpURLConnection.java:175)=0A [testSpec]     at sun.net.www.protoco=
l.ftp.FtpURLConnection.getInputStream(FtpURLConnection.java:257)=0A [testSp=
ec]     at com.meterware.httpunit.HttpWebResponse.getInputStream(HttpWebRes=
ponse.java:68)=0A [testSpec]     at com.meterware.httpunit.HttpWebResponse.=
<init>(HttpWebResponse.java:61)=0A [testSpec]     at com.meterware.httpunit=
.WebConversation.newResponse(WebConversation.java:61)=0A [testSpec]     at =
com.meterware.httpunit.WebWindow.getResource(WebWindow.java:162)=0A [testSp=
ec]     at com.meterware.httpunit.WebWindow.getSubframeResponse(WebWindow.j=
ava:125)=0A [testSpec]     at com.meterware.httpunit.WebWindow.getResponse(=
WebWindow.java:118)=0A [testSpec]     at com.meterware.httpunit.WebWindow.g=
etResponse(WebWindow.java:99)=0A [testSpec]     at com.meterware.httpunit.W=
ebClient.getResponse(WebClient.java:86)=0A [testSpec]     at com.canoo.webt=
est.steps.request.Target.getResponse(Target.java:179)=0A [testSpec]     at =
com.canoo.webtest.steps.request.Target$2.call(Target.java:156)=0A [testSpec=
]     at com.canoo.webtest.steps.request.Target.protectedGoto(Target.java:1=
06)=0A [testSpec]     at com.canoo.webtest.steps.request.Target.gotoTarget(=
Target.java:153)=0A [testSpec]     at com.canoo.webtest.steps.request.Invok=
ePage.doExecute(InvokePage.java:37)=0A [testSpec]     at com.canoo.webtest.=
steps.Step.execute(Step.java:99)=0A [testSpec]     at com.canoo.webtest.eng=
ine.Engine.executeSteps(Engine.java:26)=0A [testSpec]     at com.canoo.webt=
est.ant.TestSpecificationTask.execute(TestSpecificationTask.java:68)=0A [te=
stSpec]     at org.apache.tools.ant.UnknownElement.execute(UnknownElement.j=
ava:166)=0A [testSpec]     at org.apache.tools.ant.Task.perform(Task.java:3=
17)=0A [testSpec]     at org.apache.tools.ant.Target.execute(Target.java:30=
9)=0A [testSpec]     at org.apache.tools.ant.Target.performTasks(Target.jav=
a:334)=0A [testSpec]     at org.apache.tools.ant.Project.executeTarget(Proj=
ect.java:1306)=0A [testSpec]     at org.apache.tools.ant.Project.executeTar=
gets(Project.java:1250)=0A [testSpec]     at org.apache.tools.ant.Main.runB=
uild(Main.java:610)=0A [testSpec]     at org.apache.tools.ant.Main.start(Ma=
in.java:196)=0A [testSpec]     at org.apache.tools.ant.Main.main(Main.java:=
235)=0A=0ABUILD FAILED=0Afile:E:/PreVista/CanooWebTest/doc/samples/installT=
est.xml:10: Test failed.=0AException raised: com.canoo.webtest.engine.StepE=
xecutionException: Unexpected exception caught: java.net.UnknownHostExcepti=
on: E, Step: InvokePage=0A        at com.canoo.webtest.steps.Step.handleUne=
xpectedException(Step.java:334)=0A        at com.canoo.webtest.steps.reques=
t.Target.protectedGoto(Target.java:115)=0A        at com.canoo.webtest.step=
s.request.Target.gotoTarget(Target.java:153)=0A        at com.canoo.webtest=
.steps.request.InvokePage.doExecute(InvokePage.java:37)=0A        at com.ca=
noo.webtest.steps.Step.execute(Step.java:99)=0A        at com.canoo.webtest=
.engine.Engine.executeSteps(Engine.java:26)=0A        at com.canoo.webtest.=
ant.TestSpecificationTask.execute(TestSpecificationTask.java:68)=0A        =
at org.apache.tools.ant.UnknownElement.execute(UnknownElement.java:166)=0A =
       at org.apache.tools.ant.Task.perform(Task.java:317)=0A        at org=
.apache.tools.ant.Target.execute(Target.java:309)=0A        at org.apache.t=
ools.ant.Target.performTasks(Target.java:334)=0A        at org.apache.tools=
.ant.Project.executeTarget(Project.java:1306)=0A        at org.apache.tools=
.ant.Project.executeTargets(Project.java:1250)=0A        at org.apache.tool=
s.ant.Main.runBuild(Main.java:610)=0A        at org.apache.tools.ant.Main.s=
tart(Main.java:196)=0A        at org.apache.tools.ant.Main.main(Main.java:2=
35)=0A=0A=0ATotal time: 26 seconds=0AE:\PreVista\CanooWebTest\doc\samples>a=
nt -buildfile installTest.xml=0A=0Aplease tell me what cud be the problem=
=0A=0A
--Next_1087550769---0-202.54.124.151-30264--