[Webtest] (no subject)

sumathi P webtest@lists.canoo.com
21 Jun 2004 04:27:41 -0000


 This is a multipart mime message


--Next_1087792061---0-202.54.124.153-25011
Content-type: text/html;
	charset=iso-8859-1
Content-Transfer-Encoding: quoted-printable
Content-Disposition: inline

<P>=0A&nbsp; <BR>=0ACan u please tell me further about the configuration,ch=
anges that has to be done in instatllTest.xml ?<BR>=0A<BR>=0AThanks in Adva=
nce !!<BR>=0A<BR>=0AOn Fri, 18 Jun 2004 Arvind Joshi wrote :<BR>=0A&gt;Hi ,=
<BR>=0A&gt;<BR>=0A&gt;U have to make proper changes to the &quot;installTes=
t.xml&quot; according to your<BR>=0A&gt;environment (config part), before r=
unning the test.<BR>=0A&gt;<BR>=0A&gt;Thanks,<BR>=0A&gt;<BR>=0A&gt;Arvind<B=
R>=0A&gt;<BR>=0A&gt;<BR>=0A&gt;<BR>=0A&gt;-----Original Message-----<BR>=0A=
&gt; From: webtest-admin@gate2.canoo.com [mailto:webtest-admin@gate2.canoo.=
com]On<BR>=0A&gt;Behalf Of sumathi P<BR>=0A&gt;Sent: Friday, June 18, 2004 =
2:56 PM<BR>=0A&gt;To: webtest@gate2.canoo.com<BR>=0A&gt;Subject: [Webtest] =
(no subject)<BR>=0A&gt;<BR>=0A&gt;<BR>=0A&gt;<BR>=0A&gt;&nbsp;  Hello ,<BR>=
=0A&gt;&nbsp;  I'm new to this application . Can any one please guide me th=
rough&nbsp; the<BR>=0A&gt;configuration processes .<BR>=0A&gt;&nbsp;  I tri=
ed by running<BR>=0A&gt;&nbsp;  ant -buildfile installTest.xml<BR>=0A&gt;<B=
R>=0A&gt;&nbsp;  I'm getting the following exception,<BR>=0A&gt;<BR>=0A&gt;=
&nbsp;  E:\PreVista\CanooWebTest\doc\samples&gt;ant -buildfile installTest.=
xml<BR>=0A&gt;&nbsp;  Buildfile: installTest.xml<BR>=0A&gt;<BR>=0A&gt;&nbsp=
;  checkANT:<BR>=0A&gt;<BR>=0A&gt;&nbsp;  mayPrintANTError:<BR>=0A&gt;<BR>=
=0A&gt;&nbsp;  checkWebTest:<BR>=0A&gt;&nbsp; &nbsp; &nbsp;  [echo] base di=
r is E:\PreVista\CanooWebTest\doc\samples<BR>=0A&gt;&nbsp;  [testSpec] ERRO=
R (Step.java:333) - Cannot handle unexpected exception in<BR>=0A&gt;step In=
vokePage at&nbsp; with (stepId=3D&quot;get local file&quot;, url=3D&quot;E:=
\PreVista\Cano<BR>=0A&gt;&nbsp;  [testSpec] java.net.UnknownHostException: =
E<BR>=0A&gt;&nbsp;  [testSpec]&nbsp; &nbsp; at<BR>=0A&gt;java.net.PlainSock=
etImpl.connect(PlainSocketImpl.java:153)<BR>=0A&gt;&nbsp;  [testSpec]&nbsp;=
 &nbsp; at java.net.Socket.connect(Socket.java:452)<BR>=0A&gt;&nbsp;  [test=
Spec]&nbsp; &nbsp; at java.net.Socket.connect(Socket.java:402)<BR>=0A&gt;&n=
bsp;  [testSpec]&nbsp; &nbsp; at sun.net.NetworkClient.doConnect(NetworkCli=
ent.java:139)<BR>=0A&gt;&nbsp;  [testSpec]&nbsp; &nbsp; at sun.net.NetworkC=
lient.openServer(NetworkClient.java:118)<BR>=0A&gt;&nbsp;  [testSpec]&nbsp;=
 &nbsp; at sun.net.ftp.FtpClient.openServer(FtpClient.java:423)<BR>=0A&gt;&=
nbsp;  [testSpec]&nbsp; &nbsp; at sun.net.ftp.FtpClient.&lt;init&gt;(FtpCli=
ent.java:692)<BR>=0A&gt;&nbsp;  [testSpec]&nbsp; &nbsp; at<BR>=0A&gt;sun.ne=
t.www.protocol.ftp.FtpURLConnection.connect(FtpURLConnection.java:175)<BR>=
=0A&gt;&nbsp;  [testSpec]&nbsp; &nbsp; at<BR>=0A&gt;sun.net.www.protocol.ft=
p.FtpURLConnection.getInputStream(FtpURLConnection.ja<BR>=0A&gt;va:257)<BR>=
=0A&gt;&nbsp;  [testSpec]&nbsp; &nbsp; at<BR>=0A&gt;com.meterware.httpunit.=
HttpWebResponse.getInputStream(HttpWebResponse.java:6<BR>=0A&gt;8)<BR>=0A&g=
t;&nbsp;  [testSpec]&nbsp; &nbsp; at<BR>=0A&gt;com.meterware.httpunit.HttpW=
ebResponse.&lt;init&gt;(HttpWebResponse.java:61)<BR>=0A&gt;&nbsp;  [testSpe=
c]&nbsp; &nbsp; at<BR>=0A&gt;com.meterware.httpunit.WebConversation.newResp=
onse(WebConversation.java:61)<BR>=0A&gt;&nbsp;  [testSpec]&nbsp; &nbsp; at<=
BR>=0A&gt;com.meterware.httpunit.WebWindow.getResource(WebWindow.java:162)<=
BR>=0A&gt;&nbsp;  [testSpec]&nbsp; &nbsp; at<BR>=0A&gt;com.meterware.httpun=
it.WebWindow.getSubframeResponse(WebWindow.java:125)<BR>=0A&gt;&nbsp;  [tes=
tSpec]&nbsp; &nbsp; at<BR>=0A&gt;com.meterware.httpunit.WebWindow.getRespon=
se(WebWindow.java:118)<BR>=0A&gt;&nbsp;  [testSpec]&nbsp; &nbsp; at<BR>=0A&=
gt;com.meterware.httpunit.WebWindow.getResponse(WebWindow.java:99)<BR>=0A&g=
t;&nbsp;  [testSpec]&nbsp; &nbsp; at<BR>=0A&gt;com.meterware.httpunit.WebCl=
ient.getResponse(WebClient.java:86)<BR>=0A&gt;&nbsp;  [testSpec]&nbsp; &nbs=
p; at<BR>=0A&gt;com.canoo.webtest.steps.request.Target.getResponse(Target.j=
ava:179)<BR>=0A&gt;&nbsp;  [testSpec]&nbsp; &nbsp; at<BR>=0A&gt;com.canoo.w=
ebtest.steps.request.Target$2.call(Target.java:156)<BR>=0A&gt;&nbsp;  [test=
Spec]&nbsp; &nbsp; at<BR>=0A&gt;com.canoo.webtest.steps.request.Target.prot=
ectedGoto(Target.java:106)<BR>=0A&gt;&nbsp;  [testSpec]&nbsp; &nbsp; at<BR>=
=0A&gt;com.canoo.webtest.steps.request.Target.gotoTarget(Target.java:153)<B=
R>=0A&gt;&nbsp;  [testSpec]&nbsp; &nbsp; at<BR>=0A&gt;com.canoo.webtest.ste=
ps.request.InvokePage.doExecute(InvokePage.java:37)<BR>=0A&gt;&nbsp;  [test=
Spec]&nbsp; &nbsp; at com.canoo.webtest.steps.Step.execute(Step.java:99)<BR=
>=0A&gt;&nbsp;  [testSpec]&nbsp; &nbsp; at<BR>=0A&gt;com.canoo.webtest.engi=
ne.Engine.executeSteps(Engine.java:26)<BR>=0A&gt;&nbsp;  [testSpec]&nbsp; &=
nbsp; at<BR>=0A&gt;com.canoo.webtest.ant.TestSpecificationTask.execute(Test=
SpecificationTask.ja<BR>=0A&gt;va:68)<BR>=0A&gt;&nbsp;  [testSpec]&nbsp; &n=
bsp; at<BR>=0A&gt;org.apache.tools.ant.UnknownElement.execute(UnknownElemen=
t.java:166)<BR>=0A&gt;&nbsp;  [testSpec]&nbsp; &nbsp; at org.apache.tools.a=
nt.Task.perform(Task.java:317)<BR>=0A&gt;&nbsp;  [testSpec]&nbsp; &nbsp; at=
 org.apache.tools.ant.Target.execute(Target.java:309)<BR>=0A&gt;&nbsp;  [te=
stSpec]&nbsp; &nbsp; at org.apache.tools.ant.Target.performTasks(Target.jav=
a:334)<BR>=0A&gt;&nbsp;  [testSpec]&nbsp; &nbsp; at<BR>=0A&gt;org.apache.to=
ols.ant.Project.executeTarget(Project.java:1306)<BR>=0A&gt;&nbsp;  [testSpe=
c]&nbsp; &nbsp; at<BR>=0A&gt;org.apache.tools.ant.Project.executeTargets(Pr=
oject.java:1250)<BR>=0A&gt;&nbsp;  [testSpec]&nbsp; &nbsp; at org.apache.to=
ols.ant.Main.runBuild(Main.java:610)<BR>=0A&gt;&nbsp;  [testSpec]&nbsp; &nb=
sp; at org.apache.tools.ant.Main.start(Main.java:196)<BR>=0A&gt;&nbsp;  [te=
stSpec]&nbsp; &nbsp; at org.apache.tools.ant.Main.main(Main.java:235)<BR>=
=0A&gt;<BR>=0A&gt;&nbsp;  BUILD FAILED<BR>=0A&gt;&nbsp;  file:E:/PreVista/C=
anooWebTest/doc/samples/installTest.xml:10: Test failed.<BR>=0A&gt;&nbsp;  =
Exception raised: com.canoo.webtest.engine.StepExecutionException:<BR>=0A&g=
t;Unexpected exception caught: java.net.UnknownHostException: E, Step:<BR>=
=0A&gt;InvokePage<BR>=0A&gt;&nbsp; &nbsp; &nbsp; &nbsp; &nbsp;  at<BR>=0A&g=
t;com.canoo.webtest.steps.Step.handleUnexpectedException(Step.java:334)<BR>=
=0A&gt;&nbsp; &nbsp; &nbsp; &nbsp; &nbsp;  at<BR>=0A&gt;com.canoo.webtest.s=
teps.request.Target.protectedGoto(Target.java:115)<BR>=0A&gt;&nbsp; &nbsp; =
&nbsp; &nbsp; &nbsp;  at<BR>=0A&gt;com.canoo.webtest.steps.request.Target.g=
otoTarget(Target.java:153)<BR>=0A&gt;&nbsp; &nbsp; &nbsp; &nbsp; &nbsp;  at=
<BR>=0A&gt;com.canoo.webtest.steps.request.InvokePage.doExecute(InvokePage.=
java:37)<BR>=0A&gt;&nbsp; &nbsp; &nbsp; &nbsp; &nbsp;  at com.canoo.webtest=
.steps.Step.execute(Step.java:99)<BR>=0A&gt;&nbsp; &nbsp; &nbsp; &nbsp; &nb=
sp;  at com.canoo.webtest.engine.Engine.executeSteps(Engine.java:26)<BR>=0A=
&gt;&nbsp; &nbsp; &nbsp; &nbsp; &nbsp;  at<BR>=0A&gt;com.canoo.webtest.ant.=
TestSpecificationTask.execute(TestSpecificationTask.ja<BR>=0A&gt;va:68)<BR>=
=0A&gt;&nbsp; &nbsp; &nbsp; &nbsp; &nbsp;  at<BR>=0A&gt;org.apache.tools.an=
t.UnknownElement.execute(UnknownElement.java:166)<BR>=0A&gt;&nbsp; &nbsp; &=
nbsp; &nbsp; &nbsp;  at org.apache.tools.ant.Task.perform(Task.java:317)<BR=
>=0A&gt;&nbsp; &nbsp; &nbsp; &nbsp; &nbsp;  at org.apache.tools.ant.Target.=
execute(Target.java:309)<BR>=0A&gt;&nbsp; &nbsp; &nbsp; &nbsp; &nbsp;  at o=
rg.apache.tools.ant.Target.performTasks(Target.java:334)<BR>=0A&gt;&nbsp; &=
nbsp; &nbsp; &nbsp; &nbsp;  at org.apache.tools.ant.Project.executeTarget(P=
roject.java:1306)<BR>=0A&gt;&nbsp; &nbsp; &nbsp; &nbsp; &nbsp;  at org.apac=
he.tools.ant.Project.executeTargets(Project.java:1250)<BR>=0A&gt;&nbsp; &nb=
sp; &nbsp; &nbsp; &nbsp;  at org.apache.tools.ant.Main.runBuild(Main.java:6=
10)<BR>=0A&gt;&nbsp; &nbsp; &nbsp; &nbsp; &nbsp;  at org.apache.tools.ant.M=
ain.start(Main.java:196)<BR>=0A&gt;&nbsp; &nbsp; &nbsp; &nbsp; &nbsp;  at o=
rg.apache.tools.ant.Main.main(Main.java:235)<BR>=0A&gt;<BR>=0A&gt;<BR>=0A&g=
t;&nbsp;  Total time: 26 seconds<BR>=0A&gt;&nbsp;  E:\PreVista\CanooWebTest=
\doc\samples&gt;ant -buildfile installTest.xml<BR>=0A&gt;<BR>=0A&gt;&nbsp; =
 please tell me what cud be the problem<BR>=0A&gt;<BR>=0A&gt;<BR>=0A&gt;<BR=
>=0A&gt;<BR>=0A=0A</P>=0A=0A=0A<br><br>=0A<A target=3D"_blank" HREF=3D"http=
://clients.rediff.com/signature/track_sig.asp"><IMG SRC=3D"http://ads.redif=
f.com/RealMedia/ads/adstream_nx.cgi/www.rediffmail.com/inbox.htm@Bottom" BO=
RDER=3D0 VSPACE=3D0 HSPACE=3D0></a>=0A
--Next_1087792061---0-202.54.124.153-25011
Content-type: text/plain;
	charset=iso-8859-1
Content-Transfer-Encoding: quoted-printable
Content-Disposition: inline

 =A0=0ACan u please tell me further about the configuration,changes that ha=
s to be done in instatllTest.xml ?=0A=0AThanks in Advance !!=0A=0AOn Fri, 1=
8 Jun 2004 Arvind Joshi wrote :=0A>Hi ,=0A>=0A>U have to make proper change=
s to the "installTest.xml" according to your=0A>environment (config part), =
before running the test.=0A>=0A>Thanks,=0A>=0A>Arvind=0A>=0A>=0A>=0A>-----O=
riginal Message-----=0A> From: webtest-admin@gate2.canoo.com [mailto:webtes=
t-admin@gate2.canoo.com]On=0A>Behalf Of sumathi P=0A>Sent: Friday, June 18,=
 2004 2:56 PM=0A>To: webtest@gate2.canoo.com=0A>Subject: [Webtest] (no subj=
ect)=0A>=0A>=0A>=0A>   Hello ,=0A>   I'm new to this application . Can any =
one please guide me through  the=0A>configuration processes .=0A>   I tried=
 by running=0A>   ant -buildfile installTest.xml=0A>=0A>   I'm getting the =
following exception,=0A>=0A>   E:\PreVista\CanooWebTest\doc\samples>ant -bu=
ildfile installTest.xml=0A>   Buildfile: installTest.xml=0A>=0A>   checkANT=
:=0A>=0A>   mayPrintANTError:=0A>=0A>   checkWebTest:=0A>       [echo] base=
 dir is E:\PreVista\CanooWebTest\doc\samples=0A>   [testSpec] ERROR (Step.j=
ava:333) - Cannot handle unexpected exception in=0A>step InvokePage at  wit=
h (stepId=3D"get local file", url=3D"E:\PreVista\Cano=0A>   [testSpec] java=
.net.UnknownHostException: E=0A>   [testSpec]    at=0A>java.net.PlainSocket=
Impl.connect(PlainSocketImpl.java:153)=0A>   [testSpec]    at java.net.Sock=
et.connect(Socket.java:452)=0A>   [testSpec]    at java.net.Socket.connect(=
Socket.java:402)=0A>   [testSpec]    at sun.net.NetworkClient.doConnect(Net=
workClient.java:139)=0A>   [testSpec]    at sun.net.NetworkClient.openServe=
r(NetworkClient.java:118)=0A>   [testSpec]    at sun.net.ftp.FtpClient.open=
Server(FtpClient.java:423)=0A>   [testSpec]    at sun.net.ftp.FtpClient.<in=
it>(FtpClient.java:692)=0A>   [testSpec]    at=0A>sun.net.www.protocol.ftp.=
FtpURLConnection.connect(FtpURLConnection.java:175)=0A>   [testSpec]    at=
=0A>sun.net.www.protocol.ftp.FtpURLConnection.getInputStream(FtpURLConnecti=
on.ja=0A>va:257)=0A>   [testSpec]    at=0A>com.meterware.httpunit.HttpWebRe=
sponse.getInputStream(HttpWebResponse.java:6=0A>8)=0A>   [testSpec]    at=
=0A>com.meterware.httpunit.HttpWebResponse.<init>(HttpWebResponse.java:61)=
=0A>   [testSpec]    at=0A>com.meterware.httpunit.WebConversation.newRespon=
se(WebConversation.java:61)=0A>   [testSpec]    at=0A>com.meterware.httpuni=
t.WebWindow.getResource(WebWindow.java:162)=0A>   [testSpec]    at=0A>com.m=
eterware.httpunit.WebWindow.getSubframeResponse(WebWindow.java:125)=0A>   [=
testSpec]    at=0A>com.meterware.httpunit.WebWindow.getResponse(WebWindow.j=
ava:118)=0A>   [testSpec]    at=0A>com.meterware.httpunit.WebWindow.getResp=
onse(WebWindow.java:99)=0A>   [testSpec]    at=0A>com.meterware.httpunit.We=
bClient.getResponse(WebClient.java:86)=0A>   [testSpec]    at=0A>com.canoo.=
webtest.steps.request.Target.getResponse(Target.java:179)=0A>   [testSpec] =
   at=0A>com.canoo.webtest.steps.request.Target$2.call(Target.java:156)=0A>=
   [testSpec]    at=0A>com.canoo.webtest.steps.request.Target.protectedGoto=
(Target.java:106)=0A>   [testSpec]    at=0A>com.canoo.webtest.steps.request=
.Target.gotoTarget(Target.java:153)=0A>   [testSpec]    at=0A>com.canoo.web=
test.steps.request.InvokePage.doExecute(InvokePage.java:37)=0A>   [testSpec=
]    at com.canoo.webtest.steps.Step.execute(Step.java:99)=0A>   [testSpec]=
    at=0A>com.canoo.webtest.engine.Engine.executeSteps(Engine.java:26)=0A> =
  [testSpec]    at=0A>com.canoo.webtest.ant.TestSpecificationTask.execute(T=
estSpecificationTask.ja=0A>va:68)=0A>   [testSpec]    at=0A>org.apache.tool=
s.ant.UnknownElement.execute(UnknownElement.java:166)=0A>   [testSpec]    a=
t org.apache.tools.ant.Task.perform(Task.java:317)=0A>   [testSpec]    at o=
rg.apache.tools.ant.Target.execute(Target.java:309)=0A>   [testSpec]    at =
org.apache.tools.ant.Target.performTasks(Target.java:334)=0A>   [testSpec] =
   at=0A>org.apache.tools.ant.Project.executeTarget(Project.java:1306)=0A> =
  [testSpec]    at=0A>org.apache.tools.ant.Project.executeTargets(Project.j=
ava:1250)=0A>   [testSpec]    at org.apache.tools.ant.Main.runBuild(Main.ja=
va:610)=0A>   [testSpec]    at org.apache.tools.ant.Main.start(Main.java:19=
6)=0A>   [testSpec]    at org.apache.tools.ant.Main.main(Main.java:235)=0A>=
=0A>   BUILD FAILED=0A>   file:E:/PreVista/CanooWebTest/doc/samples/install=
Test.xml:10: Test failed.=0A>   Exception raised: com.canoo.webtest.engine.=
StepExecutionException:=0A>Unexpected exception caught: java.net.UnknownHos=
tException: E, Step:=0A>InvokePage=0A>           at=0A>com.canoo.webtest.st=
eps.Step.handleUnexpectedException(Step.java:334)=0A>           at=0A>com.c=
anoo.webtest.steps.request.Target.protectedGoto(Target.java:115)=0A>       =
    at=0A>com.canoo.webtest.steps.request.Target.gotoTarget(Target.java:153=
)=0A>           at=0A>com.canoo.webtest.steps.request.InvokePage.doExecute(=
InvokePage.java:37)=0A>           at com.canoo.webtest.steps.Step.execute(S=
tep.java:99)=0A>           at com.canoo.webtest.engine.Engine.executeSteps(=
Engine.java:26)=0A>           at=0A>com.canoo.webtest.ant.TestSpecification=
Task.execute(TestSpecificationTask.ja=0A>va:68)=0A>           at=0A>org.apa=
che.tools.ant.UnknownElement.execute(UnknownElement.java:166)=0A>          =
 at org.apache.tools.ant.Task.perform(Task.java:317)=0A>           at org.a=
pache.tools.ant.Target.execute(Target.java:309)=0A>           at org.apache=
.tools.ant.Target.performTasks(Target.java:334)=0A>           at org.apache=
.tools.ant.Project.executeTarget(Project.java:1306)=0A>           at org.ap=
ache.tools.ant.Project.executeTargets(Project.java:1250)=0A>           at o=
rg.apache.tools.ant.Main.runBuild(Main.java:610)=0A>           at org.apach=
e.tools.ant.Main.start(Main.java:196)=0A>           at org.apache.tools.ant=
.Main.main(Main.java:235)=0A>=0A>=0A>   Total time: 26 seconds=0A>   E:\Pre=
Vista\CanooWebTest\doc\samples>ant -buildfile installTest.xml=0A>=0A>   ple=
ase tell me what cud be the problem=0A>=0A>=0A>=0A>=0A=0A=0A
--Next_1087792061---0-202.54.124.153-25011--