2006q1 Archives by Thread

Starting: Mon Jan 2 05:46:27 2006
Ending: Fri Mar 31 12:53:49 2006
Messages: 634

  • [Webtest] Does have to be in a form...?   Denis N. Antonioli
  • [Webtest] How to test Select list for options using property table.   vikram shevde
  • [Webtest] [webtest][JIRA] Created: (WT-137) StepFailedException : script error   Tim (JIRA)
  • [Webtest] StepFailedException : script error   Tim Bisaerts
  • [Webtest] New feature: select and verify field with xpath!   Denis N. Antonioli
  • [Webtest] Re: StepFailedException : script error   Tim Bisaerts
  • [Webtest] Step failure and ifStep   KLOPP Gerald
  • [Webtest] Saving session between tests?   Tim Bisaerts
  • [Webtest] Re: StepFailedException : script error   Tim Bisaerts
  • [Webtest] Script error executing at: clickButton problem   Tim Miller
  • [Webtest] java.lang.OutOfMemoryError when performing login test   Tim Miller
  • [Webtest] java.lang.OutOfMemoryError when performing login test   Tim Miller
  • [Webtest] Bug with webtest.bat   Dale Ogilvie
  • [Webtest] Re: java.lang.OutOfMemoryError when performing login test   Archit P
  • [Webtest] [webtest][JIRA] Created: (WT-138) Missing /bin in build.zip 1.5 and 1.6   Ulrich Matern (JIRA)
  • [Webtest] is there any way to test a download ?   Slim Kasi
  • [Webtest] How to test select option   Tim Bisaerts
  • [Webtest] [webtest][JIRA] Closed: (WT-118) Run-time Version info for WebTest   Denis N. Antonioli (JIRA)
  • [Webtest] Complete DTD for Canoo-WebTest   Vito Caleandro
  • [Webtest] [webtest][JIRA] Created: (WT-139) IfStep : Specify test as a group of steps to execute   Gerald Klopp (JIRA)
  • [Webtest] webtest: problems with refresh   Slim Kasi
  • [Webtest] How to add option to selectfield dynamically?   Tim Bisaerts
  • [Webtest] Re: java.lang.OutOfMemoryError when performing login test   Tim Miller
  • [Webtest] [webtest][JIRA] Created: (WT-140) Error BUILD FAILED comes up as soon as I add the config element   Uwe Bartels (JIRA)
  • [Webtest] [webtest][JIRA] Created: (WT-141) Upgrade htmlunit to latest CVS status   Marc Guillemot (JIRA)
  • [Webtest] [webtest][JIRA] Created: (WT-142) Using drools within steps   Ingo Schniertshauer (JIRA)
  • [Webtest] [webtest][JIRA] Created: (WT-143) onchange of a selectbox fires twice   Niko (JIRA)
  • [Webtest] Re: Canoo WebTest and testing WAP/WML   Office 2004 Test Drive-Benutzer
  • [Webtest] Re: java.lang.OutOfMemoryError when performing login test   Archit P
  • [Webtest] Re: is there any way to test a download ?   Tim Bisaerts
  • [Webtest] [webtest][JIRA] Created: (WT-144) verifyXPath fails with "bgcolor" attribute   Jonas (JIRA)
  • [Webtest] Timeout value for invoke & co. ?   Denis N. Antonioli
  • [Webtest] [webtest][JIRA] Created: (WT-145) verifyXPath fails on non HTML or XML mime type   Peter Becker (JIRA)
  • [Webtest] scriptStep error   Tim Bisaerts
  • [Webtest] Email steps - feedback wanted   Paul King
  • [Webtest] [webtest][JIRA] Created: (WT-146) Issue with malformed html using canoo web test   Satchit Pande (JIRA)
  • [Webtest] Will all steps run with these parameters set to false?   Tim Miller
  • [Webtest] Will all steps run with these parameters set to false?   Curelea, Alexandru
  • [Webtest] [webtest][JIRA] Created: (WT-147) Upgrade htmlunit   Marc Guillemot (JIRA)
  • [Webtest] Errors trying to upgrade to latest version   Lisa Crispin
  • Nevermind! Re: [Webtest] Errors trying to upgrade to latest version   Lisa Crispin
  • [Webtest] Problem with new version of WebTest, can't find button   Lisa Crispin
  • [Webtest] Problem with html values   Tim Bisaerts
  • [Webtest] Problem with html values   Curelea, Alexandru
  • [Webtest] Problem with html values   Tim Bisaerts
  • [Webtest] [webtest][JIRA] Created: (WT-148) Javascript .js file not recognised by Webtest   Pankaj Jain (JIRA)
  • [Webtest] Re: Problem with new version of WebTest, can't find button   Lisa Crispin
  • [Webtest] Re: Nevermind! Re: Errors trying to upgrade to latest version   Lisa Crispin
  • [Webtest] Re: Problem with new version of WebTest, can't find button   Lisa Crispin
  • [Webtest] [webtest][JIRA] Created: (WT-149) compareToExpected does not support HTMLID option   Mark Johnson (JIRA)
  • [Webtest] Re: Problem with new version of WebTest, can't find button   Lisa Crispin
  • [Webtest] Nevermind again - Re: Problem with new version of WebTest, can't find button   Lisa Crispin
  • [Webtest] ScriptException: Can't find enclosing select element   Rachel Swailes
  • [Webtest] [webtest][JIRA] Created: (WT-150) Security alert   man (JIRA)
  • [Webtest] Re: ScriptException: Can't find enclosing select element   Rachel Swailes
  • [Webtest] Re: ScriptException: Can't find enclosing select element   Rachel Swailes
  • [Webtest] [webtest][JIRA] Created: (WT-151) Javascript Submit() function doesn't work in a link   Stefan Glawe (JIRA)
  • [Webtest] [webtest][JIRA] Closed: (WT-121) Feasibility study   Marc Guillemot (JIRA)
  • [Webtest] [webtest][JIRA] Closed: (WT-35) file upload on Linux mangles the file   Marc Guillemot (JIRA)
  • [Webtest] [webtest][JIRA] Created: (WT-152) Long descriptions are truncated in report   Annette Cass (JIRA)
  • [Webtest] Re: ScriptException: Can't find enclosing select element   Rachel Swailes
  • [Webtest] Build 1168 Snapshot on ibiblio for Maven 2 Users   Matt Raible
  • [Webtest] Canoo Performance Testing & AJAX   Ryan Keeling
  • [Webtest] [webtest][JIRA] Created: (WT-153) NPE when a step access Project   Denis N. Antonioli (JIRA)
  • [Webtest] RE: WebTest digest, Vol 1 #1282 - 3 msgs   David Howard
  • [Webtest] StackOverflowError, Step: ClickLink   Janet Hurwitz
  • [Webtest] I'm back to WebTest & question regarding "clickLink" implementation ...   Siegfried Goeschl
  • [Webtest] I'm back to WebTest & question regarding "clickLink" implementation ...   Siegfried Goeschl
  • [Webtest] [webtest][JIRA] Created: (WT-154) Include XSLT to produce Test Case documentation   Nate Oster (JIRA)
  • [Webtest] Problem with creation of result.html ...   =?iso-8859-1?Q?Krug_J=FCrgen?=
  • [Webtest] Re: StackOverflowError, Step: ClickLink - debug log   Janet Hurwitz
  • [Webtest] List of JavaScript "browser specific host objects"   Craig Copeland
  • [Webtest] Setting property value from an hidden field   Vinay Hattangadi
  • [Webtest] New WebTest.dtd   Denis N. Antonioli
  • [Webtest] Newbie question: automated reporting possible?   webtest@lists.canoo.com
  • [Webtest] Newbie question: automated reporting possible?   webtest@lists.canoo.com
  • [Webtest] Newbie question: automated reporting possible?   Lisa Crispin
  • [Webtest] Re: Re: List of JavaScript "browser specific host objects" (Marc)   Craig Copeland
  • [Webtest] Support for WAP   Siegfried Goeschl
  • [Webtest] Newbie question: automated reporting possible?   webtest@lists.canoo.com
  • [Webtest] Support for WAP II   Siegfried Goeschl
  • [Webtest] How to compile Canoo WebTest?   Siegfried Goeschl
  • [Webtest] [webtest][JIRA] Closed: (WT-98) When will there be a fully valid DTD or Schema for WebTest XML?   Denis N. Antonioli (JIRA)
  • [Webtest] Re: Re: Re: Re: List of JavaScript "browser specific host objects"   Craig Copeland
  • [Webtest] ScriptStep Problems. How do I start?   =?ISO-8859-1?Q?Ralf_M=FCller?=
  • [Webtest] Re: webtest: testing of external protocol   Marc Guillemot
  • [Webtest] [webtest][JIRA] Created: (WT-155) CLONE -could not find bin directory in any of the files downloaded from site   mark (JIRA)
  • [Webtest] A new WebTest release?   Denis N. Antonioli
  • [Webtest] JavaScript Error   Forouhar Pourki
  • [Webtest] button not found...   Kercher, John
  • [Webtest] [webtest][JIRA] Created: (WT-156) with href="#"   Jonathan Whitall (JIRA)
  • [Webtest] clickLink help   Jonathan Whitall
  • [Webtest] clickbutton: no button found - submit button doesn't have name attribute   Scotty Nath
  • [Webtest] Simple Fix RE: clickbutton: no button found - submit button doesn't have name attribute   Scotty Nath
  • [Webtest] [webtest][JIRA] Created: (WT-157) storeXpath should have an optional attribute to return a defaultvalue when the xpath returns nothing   Philippe Om bredanne (JIRA)
  • [Webtest] No Button Found: 4 buttons with no name on same form   Scotty Nath
  • [Webtest] Canoo WebTest included in Grails   Dierk Koenig
  • [Webtest] JavaScript Error   Forouhar Pourki
  • [Webtest] clickLink not seeing nested link labels (?)   Michael Knapp
  • [Webtest] [webtest][JIRA] Created: (WT-158) Fix timedGroup example on the official webtest site   StarBreeze (JIRA)
  • [Webtest] (no subject)   Kercher, John
  • [Webtest] Re: clickLink not seeing nested link labels (?)   Michael Knapp
  • [Webtest] overwriting configuration   Tim Bisaerts
  • [Webtest] ${property} vs #{property}   Michael Knapp
  • [Webtest] newbie question   Steve Terrell
  • [Webtest] newbie question   Steve Terrell
  • [Webtest] [dev] StepFailedException versus StepExecutionException   Marc Guillemot
  • [Webtest] question about config file   Patricia Hartnett
  • [Webtest] Re: question about config file   Patricia Hartnett
  • [Webtest] Re: question about config file   Patricia Hartnett
  • [Webtest] Canoo WebTest and support of mobile applications - A workaround   Siegfried Goeschl
  • [Webtest] How to validate a XHTML document in Canoo WebTest?   Siegfried Goeschl
  • [Webtest] question about dynamic data   Patricia Hartnett
  • [Webtest] ${property} vs #{property}   Michael Knapp
  • [Webtest] Xpath parsing problems   Michael Knapp
  • [Webtest] [webtest][JIRA] Created: (WT-159) xdoclet.DocletTast class   fraunett (JIRA)
  • [Webtest] [webtest][JIRA] Closed: (WT-73) provide documentation on how to use Canoo WebTest through groovy   Denis N. Antonioli (JIRA)
  • [Webtest] Last Call: WebTest 2.0   Denis N. Antonioli
  • [Webtest] [webtest][JIRA] Created: (WT-160) PDF Documentation   Denis N. Antonioli (JIRA)
  • [Webtest] Verifying xpath   Nguyen, Son (EDS)
  • [Webtest] =?iso-8859-15?Q?Is_there_a_"meta"-report_that_summarizes_all_the_gener?= =?iso-8859-15?Q?ated_single_report_files=3F?=   webtest@lists.canoo.com
  • [Webtest] verifyText within repeat with different properties   Daniel Brenner
  • [Webtest] support of via   Kercher, John
  • [Webtest] Recorder tool for canoo   NIcky Sandhu
  • [Webtest] [webtest][JIRA] Created: (WT-161) values not initialized within task   John Kercher (JIRA)
  • [Webtest] Web Test   Mahesh
  • [Webtest] download test   Slim Kasi
  • [Webtest] building an invoke with content to be extracted from a table taking an input.   Scotty Nath
  • [Webtest] building an invoke with content to be extracted from a table taking an input.   NIcky Sandhu
  • [Webtest] properties: namespace and importing properties files within webtest   Michael Knapp
  • [Webtest] Continuing problem with domain name in cookie   Brian Burridge
  • [Webtest] building an invoke with content to be extracted from a table taking an input.   Scotty Nath
  • Resending RE: [Webtest] building an invoke with content to be extracted from a table taking an input.   Scotty Nath
  • Resending RE: [Webtest] building an invoke with content to be extracted from a table taking an input.   NIcky Sandhu
  • [Webtest] properties: namespace and importing properties files within webtest   NIcky Sandhu
  • Summary of stuff that worked! RE: [Webtest] building an invoke with content to be extracted = from a table taking an input.   Scotty Nath
  • [Webtest] haltonerror/haltonfailure in v1.7r1212   =?ISO-8859-15?Q?Stefan_Vo=DF?=
  • [Webtest] Re: Continuing problem with domain name in cookie   Brian Burridge
  • [Webtest] Re: properties: namespace and importing properties files within webtest   Michael Knapp
  • [Webtest] setinputfield step ignoring maxlength   Daniel Brenner
  • [Webtest] scriptStep language Java   Roopa ML
  • [Webtest] setselectfield: TypeError: Cannot find default value for object (javascript)   Scotty Nath
  • [Webtest] Does 'clickLink' work with   Nguyen, Hoang
  • [Webtest] Re: download test   =?iso-8859-1?Q?Lothar_M=E4rkle?=
  • [Webtest] finding elements outside table   Marius Oancea
  • [Webtest] [webtest][JIRA] Created: (WT-162) enable steps within ant macros to be displayed in result report   Michael Quenzer (JIRA)
  • [Webtest] Having trouble using errorproperty and failureproperty   Janet Hurwitz
  • [Webtest] build failure while upgrading to 2.0   Ji Yun Kim
  • [Webtest] scriptStep language Java   Roopa ML
  • [Webtest] JavaScript file not found stops task   Juergen Damke
  • [Webtest] haltonfailure/haltonerror   =?ISO-8859-15?Q?Stefan_Vo=DF?=
  • [Webtest] question about makeing several calls of a webpage at the same time.   Daniel Raffaele
  • [Webtest] unsubscribe   Antonella Biunda
  • [Webtest] Knowing if any failues after using haltonerror & haltonfailure =   Janet Hurwitz
  • [Webtest] FW: new plug-in version for maven   Dierk Koenig
  • [Webtest] incorrect usage of ?   Kercher, John
  • [Webtest] Trick to get an overview of ALL content received by webtest   Marc Guillemot
  • [Webtest] A pom for WebTest   Denis N. Antonioli
  • [Webtest] Select link in list with no id, href or name   Emmet Cahill
  • [Webtest] exception when running long url   Mahesh
  • [Webtest] Does 'clickLink' work with   Nguyen, Hoang
  • [Webtest] excel issue: File does not have correct content type (not a '.xls' file?):   Sanju Nath
  • [Webtest] FW: new plug-in version for maven   Hesteric Roman - Together SK
  • [Webtest] antFetch did it!   Janet Hurwitz
  • [Webtest] [webtest][JIRA] Created: (WT-163) Upgrade CruiseControl   Denis N. Antonioli (JIRA)
  • [Webtest] [webtest][JIRA] Closed: (WT-163) Upgrade CruiseControl   Denis N. Antonioli (JIRA)
  • [Webtest] official WebTest 2.0 press release   Dierk Koenig
  • [Webtest] [webtest][JIRA] Created: (WT-164) results.xml not always generated when binary compare fails   Ryan Grier (JIRA)
  • [Webtest] official WebTest 2.0 press release   Lisa Crispin
  • [Webtest] WebTest discussion on TSS   Dierk Koenig
  • [Webtest] unable to find tools.jar?   Samuel B. Quiring
  • [Webtest] <property file> -- there must be a solution...   =?ISO-8859-1?Q?Ralf_M=FCller?=
  • [Webtest] [webtest][JIRA] Created: (WT-165) webtest.bat problem with blanks in JAVA_HOME   Denis N. Antonioli (JIRA)
  • [Webtest] Proper Usage of and reporting using WebTest R1177   Siegfried Goeschl
  • [Webtest] [webtest][JIRA] Created: (WT-166) Cookie bug   Satchit Pande (JIRA)
  • [Webtest] GenerateReport resultFilename link - to actual file rather than name?   Janet Hurwitz
  • [Webtest] [Dev] Pom-based dependencies   Denis N. Antonioli
  • [Webtest] WebTestReport.xsl for R_1244 - Was: Proper usage of   Siegfried Goeschl
  • [Webtest] [info] regex now uses Java's built in regex   Marc Guillemot
  • [Webtest] [webtest][JIRA] Created: (COM-5) TestTask   S. K. (JIRA)
  • [Webtest] ClickButton not behaving as in the examples   Philippe Schoch
  • [Webtest] Bug in ScriptStep?   Denis N. Antonioli
  • [Webtest] Re: Does 'clickLink' work with   Nguyen, Hoang
  • [Webtest] [webtest][JIRA] Closed: (WT-101) ClassCastException on ClickLink step   Marc Guillemot (JIRA)
  • [Webtest] [webtest][JIRA] Closed: (WT-106) External resources not supported   Marc Guillemot (JIRA)
  • [Webtest] [webtest][JIRA] Closed: (WT-83) Post requests without first retrieving an HTML page   Marc Guillemot (JIRA)
  • [Webtest] away for two weeks   Dierk Koenig
  • [Webtest] Webtest regex: which flavor?   Michael Knapp
  • [Webtest] RE: Re: Does 'clickLink' work with   Nguyen, Hoang
  • [Webtest] [webtest][JIRA] Created: (WT-167) JSF id support   Jon Nermut (JIRA)
  • [Webtest] status of continuing a session   Frank Langanke
  • [Webtest] [webtest][JIRA] Closed: (WT-81) Context to be just a field of Step   Denis N. Antonioli (JIRA)
  • [Webtest] Accessing a variable created in a previous project   Michael Knapp
  • [Webtest] Accessing a variable created in a previous project   Michael Knapp
  • [Webtest] how to change user-agent inside groovy code   Sanju Nath
  • [Webtest] Javascript issue   Ritesh Trivedi
  • [Webtest] Re: Javascript issue   Ritesh Trivedi
  • [Webtest] Stumped - Expected dialogs but none found   Curelea, Alexandru
  • [Webtest] [webtest][JIRA] Created: (WT-168) compareToExpected says two identical files differ   Ryan Grier (JIRA)
  • [Webtest] how to change user-agent inside groovy code   Sanju Nath
  • [Webtest] Stumped - Expected dialogs but none found   Curelea, Alexandru
  • [Webtest] Help needed with groovy fragment   Michael Knapp
  • [Webtest] Newbie forms submission question   =?iso-8859-1?Q?Petter_M=E5hl=E9n?=
  • [Webtest] Problems building webtest from source   =?iso-8859-1?Q?Petter_M=E5hl=E9n?=
  • [Webtest] New! Improved ChangeLog for WebTest   Denis N. Antonioli
  • [Webtest] Removing the description ''?   Denis N. Antonioli
  • [Webtest] Howto add the received HTML data into the report/result?   webtest@lists.canoo.com
  • [Webtest] [webtest][JIRA] Created: (WT-169) Removing the description ''   Denis N. Antonioli (JIRA)

    Last message date: Fri Mar 31 12:53:49 2006
    Archived on: Mon Oct 9 21:37:06 2006


    This archive was generated by Pipermail 0.05 (Mailman edition).