[Webtest] HTTP error 302

Charlie Kuharski Charlie Kuharski <ckuharsk@nmdp.org>
Thu, 16 Nov 2006 16:20:45 -0600


This is a multi-part message in MIME format.

--Boundary_(ID_ltgDxsa86li4zI8SNzr/WQ)
Content-type: text/plain; charset=windows-1252; format=flowed
Content-transfer-encoding: 8BIT

Your host is not reachable.  I'm guessing it HtmlUnit.  Try using 
something without the "...co.nz". You could try and test with HtmlUnit.
An ugly was to discover the version is to

1) replace your steps with this only:
        <verifyTitle
          description="we should see the login title"
          text="Login Page" />

2) you should see something like:
C:\test\Translink\gtest1.xml:12: Canoo Webtest: R_1393.
Test failed.
Exception raised: com.canoo.webtest.engine.StepExecutionException: No 
current response available! Is previous invoke miss
itle at C:\test\Translink\gtest1.xml:30:  with (description="we should 
see the login title", taskName="verifyTitle", text
anoo.webtest.engine.StepExecutionException: No current response 
available! Is previous invoke missing?, Step: VerifyTitle
nk\gtest1.xml:30:  with (description="we should see the login title", 
taskName="verifyTitle", text="Login Page")

Good luck.

John and Pip wrote:
>
> Hi,
>
> I have a test that is failing to follow a 302 error. I've searched the 
> archives and played around trying to enable redirects but nothing 
> seems to work.
>
> Below is the stripped-down test (just one invoke) and the output. This 
> is a publicly available page so you can hit 
> https://flightbookings.airnewzealand.co.nz/isbook_en_NZ/book/initSearchForFlights.do 
> from either IE or Firefox so I'm hoping someone can help me figure out 
> how to hit this page from WebTest! Note that I've tried an internal 
> page that is http rather than https and get the same problem so it 
> isn't related to SSL.
>
> I am using Java 1.5.0.6 <http://1.5.0.6>, HTMLUnit 1.10 and WebTest 
> R_1393 (I think! How can I verify this?).
>
> Regards,
>
>         John
>
> <?xml version="1.0"?>
>
> <!DOCTYPE project SYSTEM "WebTest.dtd">
>
> <project name="OLH" basedir="." default="main">
>
>     <property name="webtest.home" location="..\.."/>
>
>     <import file="${webtest.home}/lib/taskdef.xml"/>
>
>     <target name="main">
>
>             <webtest name="ISIS SFF NZ Search">
>
>                         <steps>
>
>                                                 <invoke 
> description="ISIS SFF NZ search page" 
> url="https://flightbookings.airnewzealand.co.nz/isbook_en_NZ/book/initSearchForFlights.do" 
> />                                               
>
>                                     </steps>
>
>                         </webtest>
>
>             </target>
>
> </project>
>
>  
>
> Here is the output:
>
>  
>
> <?xml version="1.0" encoding="UTF-8"?>
>
> <summary Implementation-Title="Canoo Webtest" 
> Implementation-Version="R_1389">
>
>     <testresult endtime="Fri Nov 17 09:25:42 NZDT 2006"
>
>         location="F:\WebTest\doc\ISIS\tempTest.xml:7: " starttime="Fri 
> Nov 17 09:25:40 NZDT 2006"
>
>         successful="no" testspecname="ISIS SFF NZ Search">
>
>         <config>
>
>             [snipped because I give the full URL below  get same 
> result if set up config properly including port 443]
>
>         </config>
>
>         <results>
>
>             <step>
>
>                 <parameter name="description" value="ISIS SFF NZ 
> search page"/>
>
>                 <parameter name="method" value="GET"/>
>
>                 <parameter name="resultFilename" 
> value="response_1163708742276_invoke.html"/>
>
>                 <parameter name="taskName" value="invoke"/>
>
>                 <parameter name="url" 
> value="https://flightbookings.airnewzealand.co.nz/isbook_en_NZ/book/initSearchForFlights.do"/> 
>
>
>                 <result>
>
>                     <failed duration="1469"/>
>
>                 </result>
>
>                 <htmlparser>
>
>                     <error col="1" line="1" 
> url="https://flightbookings.airnewzealand.co.nz/isbook_en_NZ/book/initSearchForFlights.do">Empty 
> document.</error>
>
>                 </htmlparser>
>
>             </step>
>
>             <failure 
> message="com.canoo.webtest.engine.StepFailedException: Step[invoke 
> &quot;ISIS SFF NZ search page&quot; (1/1)]: HTTP error 302, at: 
> invoke, Step: InvokePage at F:\WebTest\doc\ISIS\tempTest.xml:9:  with 
> (description=&quot;ISIS SFF NZ search page&quot;, 
> method=&quot;GET&quot;, 
> resultFilename=&quot;response_1163708742276_invoke.html&quot;, 
> taskName=&quot;invoke&quot;, 
> url=&quot;https://flightbookings.airnewzealand.co.nz/isbook_en_NZ/book/initSearchForFlights.do&quot;)"/>
>
>         </results>
>
>     </testresult>
>
> </summary>
>
>  
>

--Boundary_(ID_ltgDxsa86li4zI8SNzr/WQ)
Content-type: text/html; charset=windows-1252
Content-transfer-encoding: 8BIT

<!DOCTYPE html PUBLIC "-//W3C//DTD HTML 4.01 Transitional//EN">
<html>
<head>
  <meta content="text/html;charset=windows-1252"
 http-equiv="Content-Type">
</head>
<body bgcolor="#ffffff" text="#000000">
Your host is not reachable. I'm guessing it HtmlUnit. Try using
something without the "...co.nz". You could try and test with HtmlUnit.<br>
An ugly was to discover the version is to <br>
<br>
1) replace your steps with this only: <br>
 &lt;verifyTitle<br>
 description="we should see the login title"<br>
 text="Login Page" /&gt;<br>
<br>
2) you should see something like:<br>
C:\test\Translink\gtest1.xml:12: Canoo Webtest: R_1393.<br>
Test failed.<br>
Exception raised: com.canoo.webtest.engine.StepExecutionException: No
current response available! Is previous invoke miss<br>
itle at C:\test\Translink\gtest1.xml:30: with (description="we should
see the login title", taskName="verifyTitle", text<br>
anoo.webtest.engine.StepExecutionException: No current response
available! Is previous invoke missing?, Step: VerifyTitle<br>
nk\gtest1.xml:30: with (description="we should see the login title",
taskName="verifyTitle", text="Login Page")<br>
<br>
Good luck.<br>
<br>
John and Pip wrote:
<blockquote
 cite="midc8ebe1c0611161302m12525e7se1db36f108a24158@mail.gmail.com"
 type="cite">
  <div class="Section1">
  <p class="MsoNormal"><font face="Times New Roman" size="3"><span
 style="font-size: 12pt;">Hi,<br>
  <br>
I have a test that is failing to follow a 302 error. I've searched the
archives and played around trying to enable redirects but nothing seems
to work. </span></font></p>
  <p class="MsoNormal"><font face="Times New Roman" size="3"><span
 style="font-size: 12pt;">Below is the stripped-down test (just one
invoke) and the output. This is a publicly available page so you can
hit </span></font><font face="Arial" size="2"><span
 style="font-size: 10pt; font-family: Arial;"><a
 href="https://flightbookings.airnewzealand.co.nz/isbook_en_NZ/book/initSearchForFlights.do">
https://flightbookings.airnewzealand.co.nz/isbook_en_NZ/book/initSearchForFlights.do</a></span></font>
from either IE or Firefox so I'm hoping someone can help me figure out
how to hit this page from WebTest! Note that I've tried an internal
page that is http rather than https and get the same problem so it
isn't related to SSL. <br>
  </p>
  <p class="MsoNormal">I am using Java <a href="http://1.5.0.6">
1.5.0.6</a>, HTMLUnit 1.10 and WebTest R_1393 (I think! How can I
verify this?).<br>
  </p>
  <p class="MsoNormal"><font face="Times New Roman" size="3"><span
 style="font-size: 12pt;">Regards,</span></font></p>
  <p class="MsoNormal"><font face="Times New Roman" size="3"><span
 style="font-size: 12pt;"> John<br>
  <br>
&lt;?xml version="1.0"?&gt;</span></font></p>
  <p class="MsoNormal"><font face="Times New Roman" size="3"><span
 style="font-size: 12pt;">&lt;!DOCTYPE project SYSTEM "WebTest.dtd"&gt;</span></font></p>
  <p class="MsoNormal"><font face="Times New Roman" size="3"><span
 style="font-size: 12pt;">&lt;project name="OLH" basedir="."
default="main"&gt;</span></font></p>
  <p class="MsoNormal"><font face="Times New Roman" size="3"><span
 style="font-size: 12pt;"> &lt;property name="webtest.home"
location="..\.."/&gt;</span></font></p>
  <p class="MsoNormal"><font face="Times New Roman" size="3"><span
 style="font-size: 12pt;"> &lt;import
file="${webtest.home}/lib/taskdef.xml"/&gt;</span></font></p>
  <p class="MsoNormal"><font face="Times New Roman" size="3"><span
 style="font-size: 12pt;"> &lt;target name="main"&gt;</span></font></p>
  <p class="MsoNormal"><font face="Times New Roman" size="3"><span
 style="font-size: 12pt;">  &lt;webtest name="ISIS SFF NZ
Search"&gt;</span></font></p>
  <p class="MsoNormal"><font face="Times New Roman" size="3"><span
 style="font-size: 12pt;">  &lt;steps&gt;</span></font></p>
  <p class="MsoNormal"><font face="Times New Roman" size="3"><span
 style="font-size: 12pt;">
&lt;invoke description="ISIS SFF NZ search page" url="<a
 href="https://flightbookings.airnewzealand.co.nz/isbook_en_NZ/book/initSearchForFlights.do">https://flightbookings.airnewzealand.co.nz/isbook_en_NZ/book/initSearchForFlights.do</a>"
/&gt;  </span></font></p>
  <p class="MsoNormal"><font face="Times New Roman" size="3"><span
 style="font-size: 12pt;">
&lt;/steps&gt;</span></font></p>
  <p class="MsoNormal"><font face="Times New Roman" size="3"><span
 style="font-size: 12pt;"> &lt;/webtest&gt;</span></font></p>
  <p class="MsoNormal"><font face="Times New Roman" size="3"><span
 style="font-size: 12pt;"> &lt;/target&gt;</span></font></p>
  <p class="MsoNormal"><font face="Times New Roman" size="3"><span
 style="font-size: 12pt;">&lt;/project&gt;</span></font></p>
  <p class="MsoNormal"><font face="Times New Roman" size="3"><span
 style="font-size: 12pt;"></span></font></p>
  <p class="MsoNormal"><font face="Times New Roman" size="3"><span
 style="font-size: 12pt;">Here is the output:</span></font></p>
  <p class="MsoNormal"><font face="Times New Roman" size="3"><span
 style="font-size: 12pt;"></span></font></p>
  <p class="MsoNormal"><font face="Arial" size="2"><span
 style="font-size: 10pt; font-family: Arial;">&lt;?xml version="1.0"
encoding="UTF-8"?&gt;</span></font></p>
  <p class="MsoNormal"><font face="Arial" size="2"><span
 style="font-size: 10pt; font-family: Arial;">&lt;summary
Implementation-Title="Canoo Webtest" Implementation-Version="R_1389"&gt;</span></font></p>
  <p class="MsoNormal"><font face="Arial" size="2"><span
 style="font-size: 10pt; font-family: Arial;"> &lt;testresult
endtime="Fri Nov 17 09:25:42 NZDT 2006"</span></font></p>
  <p class="MsoNormal"><font face="Arial" size="2"><span
 style="font-size: 10pt; font-family: Arial;">
location="F:\WebTest\doc\ISIS\tempTest.xml:7: " starttime="Fri Nov 17
09:25:40 NZDT 2006"</span></font></p>
  <p class="MsoNormal"><font face="Arial" size="2"><span
 style="font-size: 10pt; font-family: Arial;"> successful="no"
testspecname="ISIS SFF NZ Search"&gt;</span></font></p>
  <p class="MsoNormal"><font face="Arial" size="2"><span
 style="font-size: 10pt; font-family: Arial;"> &lt;config&gt;</span></font></p>
  <p class="MsoNormal"><font face="Arial" size="2"><span
 style="font-size: 10pt; font-family: Arial;"> [snipped
because I give the full URL below  get same result if set up config
properly including port 443]</span></font></p>
  <p class="MsoNormal"><font face="Arial" size="2"><span
 style="font-size: 10pt; font-family: Arial;"> &lt;/config&gt;</span></font></p>
  <p class="MsoNormal"><font face="Arial" size="2"><span
 style="font-size: 10pt; font-family: Arial;"> &lt;results&gt;</span></font></p>
  <p class="MsoNormal"><font face="Arial" size="2"><span
 style="font-size: 10pt; font-family: Arial;"> &lt;step&gt;</span></font></p>
  <p class="MsoNormal"><font face="Arial" size="2"><span
 style="font-size: 10pt; font-family: Arial;">
&lt;parameter name="description" value="ISIS SFF NZ search page"/&gt;</span></font></p>
  <p class="MsoNormal"><font face="Arial" size="2"><span
 style="font-size: 10pt; font-family: Arial;">
&lt;parameter name="method" value="GET"/&gt;</span></font></p>
  <p class="MsoNormal"><font face="Arial" size="2"><span
 style="font-size: 10pt; font-family: Arial;">
&lt;parameter name="resultFilename"
value="response_1163708742276_invoke.html"/&gt;</span></font></p>
  <p class="MsoNormal"><font face="Arial" size="2"><span
 style="font-size: 10pt; font-family: Arial;">
&lt;parameter name="taskName" value="invoke"/&gt;</span></font></p>
  <p class="MsoNormal"><font face="Arial" size="2"><span
 style="font-size: 10pt; font-family: Arial;">
&lt;parameter name="url" value="<a
 href="https://flightbookings.airnewzealand.co.nz/isbook_en_NZ/book/initSearchForFlights.do">https://flightbookings.airnewzealand.co.nz/isbook_en_NZ/book/initSearchForFlights.do</a>"/&gt;</span></font>
  </p>
  <p class="MsoNormal"><font face="Arial" size="2"><span
 style="font-size: 10pt; font-family: Arial;">
&lt;result&gt;</span></font></p>
  <p class="MsoNormal"><font face="Arial" size="2"><span
 style="font-size: 10pt; font-family: Arial;">
&lt;failed duration="1469"/&gt;</span></font></p>
  <p class="MsoNormal"><font face="Arial" size="2"><span
 style="font-size: 10pt; font-family: Arial;">
&lt;/result&gt;</span></font></p>
  <p class="MsoNormal"><font face="Arial" size="2"><span
 style="font-size: 10pt; font-family: Arial;">
&lt;htmlparser&gt;</span></font></p>
  <p class="MsoNormal"><font face="Arial" size="2"><span
 style="font-size: 10pt; font-family: Arial;">
&lt;error col="1" line="1" url="<a
 href="https://flightbookings.airnewzealand.co.nz/isbook_en_NZ/book/initSearchForFlights.do">https://flightbookings.airnewzealand.co.nz/isbook_en_NZ/book/initSearchForFlights.do</a>"&gt;Empty
document.&lt;/error&gt;</span></font></p>
  <p class="MsoNormal"><font face="Arial" size="2"><span
 style="font-size: 10pt; font-family: Arial;">
&lt;/htmlparser&gt;</span></font></p>
  <p class="MsoNormal"><font face="Arial" size="2"><span
 style="font-size: 10pt; font-family: Arial;"> &lt;/step&gt;</span></font></p>
  <p class="MsoNormal"><font face="Arial" size="2"><span
 style="font-size: 10pt; font-family: Arial;"> &lt;failure
message="com.canoo.webtest.engine.StepFailedException: Step[invoke
&amp;quot;ISIS SFF NZ search page&amp;quot; (1/1)]: HTTP error 302, at:
invoke, Step: InvokePage at F:\WebTest\doc\ISIS\tempTest.xml:9: with
(description=&amp;quot;ISIS SFF NZ search page&amp;quot;,
method=&amp;quot;GET&amp;quot;,
resultFilename=&amp;quot;response_1163708742276_invoke.html&amp;quot;,
taskName=&amp;quot;invoke&amp;quot;,
url=&amp;quot;<a class="moz-txt-link-freetext" href="https://flightbookings.airnewzealand.co.nz/isbook_en_NZ/book/initSearchForFlights.do&quot">https://flightbookings.airnewzealand.co.nz/isbook_en_NZ/book/initSearchForFlights.do&amp;quot</a>;)"/&gt;</span></font></p>
  <p class="MsoNormal"><font face="Arial" size="2"><span
 style="font-size: 10pt; font-family: Arial;"> &lt;/results&gt;</span></font></p>
  <p class="MsoNormal"><font face="Arial" size="2"><span
 style="font-size: 10pt; font-family: Arial;"> &lt;/testresult&gt;</span></font></p>
  <p class="MsoNormal"><font face="Arial" size="2"><span
 style="font-size: 10pt; font-family: Arial;">&lt;/summary&gt;</span></font></p>
  <p class="MsoNormal"><font face="Arial" size="2"><span
 style="font-size: 10pt; font-family: Arial;"></span></font></p>
  </div>
</blockquote>
</body>
</html>

--Boundary_(ID_ltgDxsa86li4zI8SNzr/WQ)--