[Webtest] HTTP error 302

John and Pip John and Pip" <pipandjohn@gmail.com
Fri, 17 Nov 2006 11:38:59 +1300


------=_Part_21560_19631633.1163716739988
Content-Type: text/plain; charset=WINDOWS-1252; format=flowed
Content-Transfer-Encoding: quoted-printable
Content-Disposition: inline

Hi Charlie,

Thanks for your response.

Do you mean you couldn't reach
https://flightbookings.airnewzealand.co.nz/isbook_en_NZ/book/initSearchForF=
lights.dofrom
a browser or that you think WebTest believes it is not reachable? This
is the main public URL of the Air New Zealand flight booking engine, and we
have a screen up in the office showing bookings coming through every minute=
!


re testing with HTMLUnit: I'm not a java programmer - just a tester, trying
to figure out whether I need to be a java programmer to use WebTest!

Thanks for the hint re version number. I see this is R_1389. In fact to my
embarrassment I see this even appears in my email below!

regards,
         John

On 11/17/06, Charlie Kuharski <ckuharsk@nmdp.org> wrote:
>
>  Your host is not reachable.  I'm guessing it HtmlUnit.  Try using
> something without the "...co.nz". You could try and test with HtmlUnit.
> An ugly was to discover the version is to
>
> 1) replace your steps with this only:
>         <verifyTitle
>           description=3D"we should see the login title"
>           text=3D"Login Page" />
>
> 2) you should see something like:
> C:\test\Translink\gtest1.xml:12: Canoo Webtest: R_1393.
> Test failed.
> Exception raised: com.canoo.webtest.engine.StepExecutionException: No
> current response available! Is previous invoke miss
> itle at C:\test\Translink\gtest1.xml:30:  with (description=3D"we should =
see
> the login title", taskName=3D"verifyTitle", text
> anoo.webtest.engine.StepExecutionException: No current response available=
!
> Is previous invoke missing?, Step: VerifyTitle
> nk\gtest1.xml:30:  with (description=3D"we should see the login title",
> taskName=3D"verifyTitle", text=3D"Login Page")
>
> Good luck.
>
> John and Pip wrote:
>
>  Hi,
>
> I have a test that is failing to follow a 302 error. I've searched the
> archives and played around trying to enable redirects but nothing seems t=
o
> work.
>
> Below is the stripped-down test (just one invoke) and the output. This is
> a publicly available page so you can hit
> https://flightbookings.airnewzealand.co.nz/isbook_en_NZ/book/initSearchFo=
rFlights.dofrom either IE or Firefox so I'm hoping someone can help me figu=
re out how
> to hit this page from WebTest! Note that I've tried an internal page that=
 is
> http rather than https and get the same problem so it isn't related to SS=
L.
>
> I am using Java 1.5.0.6, HTMLUnit 1.10 and WebTest R_1393 (I think! How
> can I verify this?).
>
> Regards,
>
>         John
>
> <?xml version=3D"1.0"?>
>
> <!DOCTYPE project SYSTEM "WebTest.dtd">
>
> <project name=3D"OLH" basedir=3D"." default=3D"main">
>
>     <property name=3D"webtest.home" location=3D"..\.."/>
>
>     <import file=3D"${webtest.home}/lib/taskdef.xml"/>
>
>     <target name=3D"main">
>
>             <webtest name=3D"ISIS SFF NZ Search">
>
>                         <steps>
>
>                                                 <invoke description=3D"IS=
IS
> SFF NZ search page" url=3D"
> https://flightbookings.airnewzealand.co.nz/isbook_en_NZ/book/initSearchFo=
rFlights.do"
> />
>
>                                     </steps>
>
>                         </webtest>
>
>             </target>
>
> </project>
>
>
>
> Here is the output:
>
>
>
> <?xml version=3D"1.0" encoding=3D"UTF-8"?>
>
> <summary Implementation-Title=3D"Canoo Webtest"
> Implementation-Version=3D"R_1389">
>
>     <testresult endtime=3D"Fri Nov 17 09:25:42 NZDT 2006"
>
>         location=3D"F:\WebTest\doc\ISIS\tempTest.xml:7: " starttime=3D"Fr=
i Nov
> 17 09:25:40 NZDT 2006"
>
>         successful=3D"no" testspecname=3D"ISIS SFF NZ Search">
>
>         <config>
>
>             [snipped because I give the full URL below =96 get same resul=
t
> if set up config properly including port 443]
>
>         </config>
>
>         <results>
>
>             <step>
>
>                 <parameter name=3D"description" value=3D"ISIS SFF NZ sear=
ch
> page"/>
>
>                 <parameter name=3D"method" value=3D"GET"/>
>
>                 <parameter name=3D"resultFilename"
> value=3D"response_1163708742276_invoke.html"/>
>
>                 <parameter name=3D"taskName" value=3D"invoke"/>
>
>                 <parameter name=3D"url" value=3D"
> https://flightbookings.airnewzealand.co.nz/isbook_en_NZ/book/initSearchFo=
rFlights.do
> "/>
>
>                 <result>
>
>                     <failed duration=3D"1469"/>
>
>                 </result>
>
>                 <htmlparser>
>
>                     <error col=3D"1" line=3D"1" url=3D"
> https://flightbookings.airnewzealand.co.nz/isbook_en_NZ/book/initSearchFo=
rFlights.do">Empty
> document.</error>
>
>                 </htmlparser>
>
>             </step>
>
>             <failure message=3D"com.canoo.webtest.engine.StepFailedExcept=
ion:
> Step[invoke &quot;ISIS SFF NZ search page&quot; (1/1)]: HTTP error 302, a=
t:
> invoke, Step: InvokePage at F:\WebTest\doc\ISIS\tempTest.xml:9:  with
> (description=3D&quot;ISIS SFF NZ search page&quot;, method=3D&quot;GET&qu=
ot;,
> resultFilename=3D&quot;response_1163708742276_invoke.html&quot;,
> taskName=3D&quot;invoke&quot;, url=3D&quot;
> https://flightbookings.airnewzealand.co.nz/isbook_en_NZ/book/initSearchFo=
rFlights.do&quot
> ;)"/>
>
>         </results>
>
>     </testresult>
>
> </summary>
>
>
>
>

------=_Part_21560_19631633.1163716739988
Content-Type: text/html; charset=WINDOWS-1252
Content-Transfer-Encoding: quoted-printable
Content-Disposition: inline

Hi Charlie,<br><br>Thanks for your response.<br><br>Do you mean you couldn'=
t reach <span class=3D"e" id=3D"q_10ef2dc88d89947b_1"><font face=3D"Arial" =
size=3D"2"><span style=3D"font-size: 10pt; font-family: Arial;"></span></fo=
nt></span>
<font face=3D"Arial" size=3D"2"><a href=3D"https://flightbookings.airnewzea=
land.co.nz/isbook_en_NZ/book/initSearchForFlights.do" target=3D"_blank" onc=
lick=3D"return top.js.OpenExtLink(window,event,this)">
https://flightbookings.airnewzealand.co.nz/isbook_en_NZ/book/initSearchForF=
lights.do</a></font>   from a browser or that you think WebTest believes it=
 is not reachable? This is the main public URL of the Air New Zealand fligh=
t booking engine, and we have a screen up in the office showing bookings co=
ming through every minute!=20
<br><br>re testing with HTMLUnit: I'm not a java programmer - just a tester=
, trying to figure out whether I need to be a java programmer to use WebTes=
t!<br><br>Thanks for the hint re version number. I see this is R_1389. In f=
act to my embarrassment I see this even appears in my email below!
<br><br>regards,<br>&nbsp;&nbsp;&nbsp;&nbsp;&nbsp;&nbsp;&nbsp;&nbsp; John<b=
r><br><div><span class=3D"gmail_quote">On 11/17/06, <b class=3D"gmail_sende=
rname">Charlie Kuharski</b> &lt;<a href=3D"mailto:ckuharsk@nmdp.org">ckuhar=
sk@nmdp.org</a>&gt; wrote:</span><blockquote class=3D"gmail_quote" style=3D=
"border-left: 1px solid rgb(204, 204, 204); margin: 0pt 0pt 0pt 0.8ex; padd=
ing-left: 1ex;">



 =20

<div bgcolor=3D"#ffffff" text=3D"#000000">
Your host is not reachable.&nbsp; I'm guessing it HtmlUnit.&nbsp; Try using
something without the &quot;...co.nz&quot;. You could try and test with Htm=
lUnit.<br>
An ugly was to discover the version is to <br>
<br>
1) replace your steps with this only: <br>
&nbsp;&nbsp;&nbsp;&nbsp;&nbsp;&nbsp;&nbsp; &lt;verifyTitle<br>
&nbsp;&nbsp;&nbsp;&nbsp;&nbsp;&nbsp;&nbsp;&nbsp;&nbsp; description=3D&quot;=
we should see the login title&quot;<br>
&nbsp;&nbsp;&nbsp;&nbsp;&nbsp;&nbsp;&nbsp;&nbsp;&nbsp; text=3D&quot;Login P=
age&quot; /&gt;<br>
<br>
2) you should see something like:<br>
C:\test\Translink\gtest1.xml:12: Canoo Webtest: R_1393.<br>
Test failed.<br>
Exception raised: com.canoo.webtest.engine.StepExecutionException: No
current response available! Is previous invoke miss<br>
itle at C:\test\Translink\gtest1.xml:30:&nbsp; with (description=3D&quot;we=
 should
see the login title&quot;, taskName=3D&quot;verifyTitle&quot;, text<br>
anoo.webtest.engine.StepExecutionException: No current response
available! Is previous invoke missing?, Step: VerifyTitle<br>
nk\gtest1.xml:30:&nbsp; with (description=3D&quot;we should see the login t=
itle&quot;,
taskName=3D&quot;verifyTitle&quot;, text=3D&quot;Login Page&quot;)<br>
<br>
Good luck.<div><span class=3D"e" id=3D"q_10ef2dc88d89947b_1"><br>
<br>
John and Pip wrote:
<blockquote cite=3D"http://midc8ebe1c0611161302m12525e7se1db36f108a24158@ma=
il.gmail.com" type=3D"cite">
  <div>
  <p><font face=3D"Times New Roman" size=3D"3"><span style=3D"font-size: 12=
pt;">Hi,<br>
  <br>
I have a test that is failing to follow a 302 error. I've searched the
archives and played around trying to enable redirects but nothing seems
to work. </span></font></p>
  <p><font face=3D"Times New Roman" size=3D"3"><span style=3D"font-size: 12=
pt;">Below is the stripped-down test (just one
invoke) and the output. This is a publicly available page so you can
hit </span></font><font face=3D"Arial" size=3D"2"><span style=3D"font-size:=
 10pt; font-family: Arial;"><a href=3D"https://flightbookings.airnewzealand=
.co.nz/isbook_en_NZ/book/initSearchForFlights.do" target=3D"_blank" onclick=
=3D"return top.js.OpenExtLink(window,event,this)">

https://flightbookings.airnewzealand.co.nz/isbook_en_NZ/book/initSearchForF=
lights.do</a></span></font>
from either IE or Firefox so I'm hoping someone can help me figure out
how to hit this page from WebTest! Note that I've tried an internal
page that is http rather than https and get the same problem so it
isn't related to SSL. <br>
  </p>
  <p>I am using Java <a href=3D"http://1.5.0.6" target=3D"_blank" onclick=
=3D"return top.js.OpenExtLink(window,event,this)">
1.5.0.6</a>, HTMLUnit 1.10 and WebTest R_1393 (I think! How can I
verify this?).<br>
  </p>
  <p><font face=3D"Times New Roman" size=3D"3"><span style=3D"font-size: 12=
pt;">Regards,</span></font></p>
  <p><font face=3D"Times New Roman" size=3D"3"><span style=3D"font-size: 12=
pt;">&nbsp;&nbsp;&nbsp;&nbsp;&nbsp;&nbsp;&nbsp; John<br>
  <br>
&lt;?xml version=3D&quot;1.0&quot;?&gt;</span></font></p>
  <p><font face=3D"Times New Roman" size=3D"3"><span style=3D"font-size: 12=
pt;">&lt;!DOCTYPE project SYSTEM &quot;WebTest.dtd&quot;&gt;</span></font><=
/p>
  <p><font face=3D"Times New Roman" size=3D"3"><span style=3D"font-size: 12=
pt;">&lt;project name=3D&quot;OLH&quot; basedir=3D&quot;.&quot;
default=3D&quot;main&quot;&gt;</span></font></p>
  <p><font face=3D"Times New Roman" size=3D"3"><span style=3D"font-size: 12=
pt;">&nbsp;&nbsp;&nbsp; &lt;property name=3D&quot;webtest.home&quot;
location=3D&quot;..\..&quot;/&gt;</span></font></p>
  <p><font face=3D"Times New Roman" size=3D"3"><span style=3D"font-size: 12=
pt;">&nbsp;&nbsp;&nbsp; &lt;import
file=3D&quot;${webtest.home}/lib/taskdef.xml&quot;/&gt;</span></font></p>
  <p><font face=3D"Times New Roman" size=3D"3"><span style=3D"font-size: 12=
pt;">&nbsp;&nbsp;&nbsp; &lt;target name=3D&quot;main&quot;&gt;</span></font=
></p>
  <p><font face=3D"Times New Roman" size=3D"3"><span style=3D"font-size: 12=
pt;">&nbsp;&nbsp;&nbsp; &nbsp;&nbsp;&nbsp;&nbsp;&nbsp;&nbsp;&nbsp; &lt;webt=
est name=3D&quot;ISIS SFF NZ
Search&quot;&gt;</span></font></p>
  <p><font face=3D"Times New Roman" size=3D"3"><span style=3D"font-size: 12=
pt;">&nbsp;&nbsp;&nbsp; &nbsp;&nbsp;&nbsp;&nbsp;&nbsp;&nbsp;&nbsp;&nbsp;&nb=
sp;&nbsp;&nbsp;&nbsp;&nbsp;&nbsp;&nbsp;&nbsp;&nbsp;&nbsp;&nbsp; &lt;steps&g=
t;</span></font></p>
  <p><font face=3D"Times New Roman" size=3D"3"><span style=3D"font-size: 12=
pt;">&nbsp;&nbsp;&nbsp;&nbsp;&nbsp;&nbsp;&nbsp;&nbsp;&nbsp;&nbsp;&nbsp;&nbs=
p;&nbsp;&nbsp;&nbsp;&nbsp;&nbsp;&nbsp;&nbsp;&nbsp;&nbsp;&nbsp;&nbsp;&nbsp;&=
nbsp;&nbsp;&nbsp;&nbsp;&nbsp;&nbsp;&nbsp;&nbsp;&nbsp;&nbsp;&nbsp;&nbsp;&nbs=
p;&nbsp;&nbsp;&nbsp;&nbsp;&nbsp;&nbsp;&nbsp;&nbsp;&nbsp;&nbsp;
&lt;invoke description=3D&quot;ISIS SFF NZ search page&quot; url=3D&quot;<a=
 href=3D"https://flightbookings.airnewzealand.co.nz/isbook_en_NZ/book/initS=
earchForFlights.do" target=3D"_blank" onclick=3D"return top.js.OpenExtLink(=
window,event,this)">
https://flightbookings.airnewzealand.co.nz/isbook_en_NZ/book/initSearchForF=
lights.do</a>&quot;
/&gt;&nbsp;&nbsp;&nbsp;&nbsp;&nbsp;&nbsp;&nbsp;&nbsp;&nbsp;&nbsp;&nbsp;&nbs=
p;&nbsp;&nbsp;&nbsp;&nbsp;&nbsp;&nbsp;&nbsp;&nbsp;&nbsp;&nbsp;&nbsp;&nbsp;&=
nbsp;&nbsp;&nbsp;&nbsp;&nbsp;&nbsp;&nbsp;&nbsp;&nbsp;&nbsp;&nbsp; &nbsp;&nb=
sp;&nbsp;&nbsp;&nbsp;&nbsp;&nbsp;&nbsp;&nbsp;&nbsp;&nbsp; </span></font></p=
>
  <p><font face=3D"Times New Roman" size=3D"3"><span style=3D"font-size: 12=
pt;">&nbsp;&nbsp;&nbsp;&nbsp;&nbsp;&nbsp;&nbsp;&nbsp;&nbsp;&nbsp;&nbsp;&nbs=
p;&nbsp;&nbsp;&nbsp;&nbsp;&nbsp;&nbsp;&nbsp;&nbsp;&nbsp;&nbsp;&nbsp;&nbsp;&=
nbsp;&nbsp;&nbsp;&nbsp;&nbsp;&nbsp;&nbsp;&nbsp;&nbsp;&nbsp;&nbsp;
&lt;/steps&gt;</span></font></p>
  <p><font face=3D"Times New Roman" size=3D"3"><span style=3D"font-size: 12=
pt;">&nbsp;&nbsp;&nbsp;&nbsp;&nbsp;&nbsp;&nbsp;&nbsp;&nbsp;&nbsp;&nbsp;&nbs=
p;&nbsp;&nbsp;&nbsp;&nbsp;&nbsp;&nbsp;&nbsp;&nbsp;&nbsp;&nbsp;&nbsp; &lt;/w=
ebtest&gt;</span></font></p>
  <p><font face=3D"Times New Roman" size=3D"3"><span style=3D"font-size: 12=
pt;">&nbsp;&nbsp;&nbsp;&nbsp;&nbsp;&nbsp;&nbsp;&nbsp;&nbsp;&nbsp;&nbsp; &lt=
;/target&gt;</span></font></p>
  <p><font face=3D"Times New Roman" size=3D"3"><span style=3D"font-size: 12=
pt;">&lt;/project&gt;</span></font></p>
  <p><font face=3D"Times New Roman" size=3D"3"><span style=3D"font-size: 12=
pt;">&nbsp;</span></font></p>
  <p><font face=3D"Times New Roman" size=3D"3"><span style=3D"font-size: 12=
pt;">Here is the output:</span></font></p>
  <p><font face=3D"Times New Roman" size=3D"3"><span style=3D"font-size: 12=
pt;">&nbsp;</span></font></p>
  <p><font face=3D"Arial" size=3D"2"><span style=3D"font-size: 10pt; font-f=
amily: Arial;">&lt;?xml version=3D&quot;1.0&quot;
encoding=3D&quot;UTF-8&quot;?&gt;</span></font></p>
  <p><font face=3D"Arial" size=3D"2"><span style=3D"font-size: 10pt; font-f=
amily: Arial;">&lt;summary
Implementation-Title=3D&quot;Canoo Webtest&quot; Implementation-Version=3D&=
quot;R_1389&quot;&gt;</span></font></p>
  <p><font face=3D"Arial" size=3D"2"><span style=3D"font-size: 10pt; font-f=
amily: Arial;">&nbsp;&nbsp;&nbsp; &lt;testresult
endtime=3D&quot;Fri Nov 17 09:25:42 NZDT 2006&quot;</span></font></p>
  <p><font face=3D"Arial" size=3D"2"><span style=3D"font-size: 10pt; font-f=
amily: Arial;">&nbsp;&nbsp;&nbsp;&nbsp;&nbsp;&nbsp;&nbsp;
location=3D&quot;F:\WebTest\doc\ISIS\tempTest.xml:7: &quot; starttime=3D&qu=
ot;Fri Nov 17
09:25:40 NZDT 2006&quot;</span></font></p>
  <p><font face=3D"Arial" size=3D"2"><span style=3D"font-size: 10pt; font-f=
amily: Arial;">&nbsp;&nbsp;&nbsp;&nbsp;&nbsp;&nbsp;&nbsp; successful=3D&quo=
t;no&quot;
testspecname=3D&quot;ISIS SFF NZ Search&quot;&gt;</span></font></p>
  <p><font face=3D"Arial" size=3D"2"><span style=3D"font-size: 10pt; font-f=
amily: Arial;">&nbsp;&nbsp;&nbsp;&nbsp;&nbsp;&nbsp;&nbsp; &lt;config&gt;</s=
pan></font></p>
  <p><font face=3D"Arial" size=3D"2"><span style=3D"font-size: 10pt; font-f=
amily: Arial;">&nbsp;&nbsp;&nbsp;&nbsp;&nbsp;&nbsp;&nbsp;&nbsp;&nbsp;&nbsp;=
&nbsp; [snipped
because I give the full URL below =96 get same result if set up config
properly including port 443]</span></font></p>
  <p><font face=3D"Arial" size=3D"2"><span style=3D"font-size: 10pt; font-f=
amily: Arial;">&nbsp;&nbsp;&nbsp;&nbsp;&nbsp;&nbsp;&nbsp; &lt;/config&gt;</=
span></font></p>
  <p><font face=3D"Arial" size=3D"2"><span style=3D"font-size: 10pt; font-f=
amily: Arial;">&nbsp;&nbsp;&nbsp;&nbsp;&nbsp;&nbsp;&nbsp; &lt;results&gt;</=
span></font></p>
  <p><font face=3D"Arial" size=3D"2"><span style=3D"font-size: 10pt; font-f=
amily: Arial;">&nbsp;&nbsp;&nbsp;&nbsp;&nbsp;&nbsp;&nbsp;&nbsp;&nbsp;&nbsp;=
&nbsp; &lt;step&gt;</span></font></p>
  <p><font face=3D"Arial" size=3D"2"><span style=3D"font-size: 10pt; font-f=
amily: Arial;">&nbsp;&nbsp;&nbsp;&nbsp;&nbsp;&nbsp;&nbsp;&nbsp;&nbsp;&nbsp;=
&nbsp;&nbsp;&nbsp;&nbsp;&nbsp;
&lt;parameter name=3D&quot;description&quot; value=3D&quot;ISIS SFF NZ sear=
ch page&quot;/&gt;</span></font></p>
  <p><font face=3D"Arial" size=3D"2"><span style=3D"font-size: 10pt; font-f=
amily: Arial;">&nbsp;&nbsp;&nbsp;&nbsp;&nbsp;&nbsp;&nbsp;&nbsp;&nbsp;&nbsp;=
&nbsp;&nbsp;&nbsp;&nbsp;&nbsp;
&lt;parameter name=3D&quot;method&quot; value=3D&quot;GET&quot;/&gt;</span>=
</font></p>
  <p><font face=3D"Arial" size=3D"2"><span style=3D"font-size: 10pt; font-f=
amily: Arial;">&nbsp;&nbsp;&nbsp;&nbsp;&nbsp;&nbsp;&nbsp;&nbsp;&nbsp;&nbsp;=
&nbsp;&nbsp;&nbsp;&nbsp;&nbsp;
&lt;parameter name=3D&quot;resultFilename&quot;
value=3D&quot;response_1163708742276_invoke.html&quot;/&gt;</span></font></=
p>
  <p><font face=3D"Arial" size=3D"2"><span style=3D"font-size: 10pt; font-f=
amily: Arial;">&nbsp;&nbsp;&nbsp;&nbsp;&nbsp;&nbsp;&nbsp;&nbsp;&nbsp;&nbsp;=
&nbsp;&nbsp;&nbsp;&nbsp;&nbsp;
&lt;parameter name=3D&quot;taskName&quot; value=3D&quot;invoke&quot;/&gt;</=
span></font></p>
  <p><font face=3D"Arial" size=3D"2"><span style=3D"font-size: 10pt; font-f=
amily: Arial;">&nbsp;&nbsp;&nbsp;&nbsp;&nbsp;&nbsp;&nbsp;&nbsp;&nbsp;&nbsp;=
&nbsp;&nbsp;&nbsp;&nbsp;&nbsp;
&lt;parameter name=3D&quot;url&quot; value=3D&quot;<a href=3D"https://fligh=
tbookings.airnewzealand.co.nz/isbook_en_NZ/book/initSearchForFlights.do" ta=
rget=3D"_blank" onclick=3D"return top.js.OpenExtLink(window,event,this)">ht=
tps://flightbookings.airnewzealand.co.nz/isbook_en_NZ/book/initSearchForFli=
ghts.do
</a>&quot;/&gt;</span></font>
  </p>
  <p><font face=3D"Arial" size=3D"2"><span style=3D"font-size: 10pt; font-f=
amily: Arial;">&nbsp;&nbsp;&nbsp;&nbsp;&nbsp;&nbsp;&nbsp;&nbsp;&nbsp;&nbsp;=
&nbsp;&nbsp;&nbsp;&nbsp;&nbsp;
&lt;result&gt;</span></font></p>
  <p><font face=3D"Arial" size=3D"2"><span style=3D"font-size: 10pt; font-f=
amily: Arial;">&nbsp;&nbsp;&nbsp;&nbsp;&nbsp;&nbsp;&nbsp;&nbsp;&nbsp;&nbsp;=
&nbsp;&nbsp;&nbsp;&nbsp;&nbsp;&nbsp;&nbsp;&nbsp;&nbsp;
&lt;failed duration=3D&quot;1469&quot;/&gt;</span></font></p>
  <p><font face=3D"Arial" size=3D"2"><span style=3D"font-size: 10pt; font-f=
amily: Arial;">&nbsp;&nbsp;&nbsp;&nbsp;&nbsp;&nbsp;&nbsp;&nbsp;&nbsp;&nbsp;=
&nbsp;&nbsp;&nbsp;&nbsp;&nbsp;
&lt;/result&gt;</span></font></p>
  <p><font face=3D"Arial" size=3D"2"><span style=3D"font-size: 10pt; font-f=
amily: Arial;">&nbsp;&nbsp;&nbsp;&nbsp;&nbsp;&nbsp;&nbsp;&nbsp;&nbsp;&nbsp;=
&nbsp;&nbsp;&nbsp;&nbsp;&nbsp;
&lt;htmlparser&gt;</span></font></p>
  <p><font face=3D"Arial" size=3D"2"><span style=3D"font-size: 10pt; font-f=
amily: Arial;">&nbsp;&nbsp;&nbsp;&nbsp;&nbsp;&nbsp;&nbsp;&nbsp;&nbsp;&nbsp;=
&nbsp;&nbsp;&nbsp;&nbsp;&nbsp;&nbsp;&nbsp;&nbsp;&nbsp;
&lt;error col=3D&quot;1&quot; line=3D&quot;1&quot; url=3D&quot;<a href=3D"h=
ttps://flightbookings.airnewzealand.co.nz/isbook_en_NZ/book/initSearchForFl=
ights.do" target=3D"_blank" onclick=3D"return top.js.OpenExtLink(window,eve=
nt,this)">
https://flightbookings.airnewzealand.co.nz/isbook_en_NZ/book/initSearchForF=
lights.do</a>&quot;&gt;Empty
document.&lt;/error&gt;</span></font></p>
  <p><font face=3D"Arial" size=3D"2"><span style=3D"font-size: 10pt; font-f=
amily: Arial;">&nbsp;&nbsp;&nbsp;&nbsp;&nbsp;&nbsp;&nbsp;&nbsp;&nbsp;&nbsp;=
&nbsp;&nbsp;&nbsp;&nbsp;&nbsp;
&lt;/htmlparser&gt;</span></font></p>
  <p><font face=3D"Arial" size=3D"2"><span style=3D"font-size: 10pt; font-f=
amily: Arial;">&nbsp;&nbsp;&nbsp; &nbsp;&nbsp;&nbsp;&nbsp;&nbsp;&nbsp;&nbsp=
;&nbsp;&lt;/step&gt;</span></font></p>
  <p><font face=3D"Arial" size=3D"2"><span style=3D"font-size: 10pt; font-f=
amily: Arial;">&nbsp;&nbsp;&nbsp;&nbsp;&nbsp;&nbsp;&nbsp;&nbsp;&nbsp;&nbsp;=
&nbsp; &lt;failure
message=3D&quot;com.canoo.webtest.engine.StepFailedException: Step[invoke
&amp;quot;ISIS SFF NZ search page&amp;quot; (1/1)]: HTTP error 302, at:
invoke, Step: InvokePage at F:\WebTest\doc\ISIS\tempTest.xml:9:&nbsp; with
(description=3D&amp;quot;ISIS SFF NZ search page&amp;quot;,
method=3D&amp;quot;GET&amp;quot;,
resultFilename=3D&amp;quot;response_1163708742276_invoke.html&amp;quot;,
taskName=3D&amp;quot;invoke&amp;quot;,
url=3D&amp;quot;<a href=3D"https://flightbookings.airnewzealand.co.nz/isboo=
k_en_NZ/book/initSearchForFlights.do&amp;quot" target=3D"_blank" onclick=3D=
"return top.js.OpenExtLink(window,event,this)">https://flightbookings.airne=
wzealand.co.nz/isbook_en_NZ/book/initSearchForFlights.do&amp;quot
</a>;)&quot;/&gt;</span></font></p>
  <p><font face=3D"Arial" size=3D"2"><span style=3D"font-size: 10pt; font-f=
amily: Arial;">&nbsp;&nbsp; &nbsp;&nbsp;&nbsp;&nbsp;&nbsp;&lt;/results&gt;<=
/span></font></p>
  <p><font face=3D"Arial" size=3D"2"><span style=3D"font-size: 10pt; font-f=
amily: Arial;">&nbsp;&nbsp;&nbsp; &lt;/testresult&gt;</span></font></p>
  <p><font face=3D"Arial" size=3D"2"><span style=3D"font-size: 10pt; font-f=
amily: Arial;">&lt;/summary&gt;</span></font></p>
  <p><font face=3D"Arial" size=3D"2"><span style=3D"font-size: 10pt; font-f=
amily: Arial;">&nbsp;</span></font></p>
  </div>
</blockquote>
</span></div></div>


</blockquote></div><br>

------=_Part_21560_19631633.1163716739988--