[Webtest] HTTP error 302

John and Pip John and Pip" <pipandjohn@gmail.com
Sat, 18 Nov 2006 08:56:13 +1300


------=_Part_31759_21583170.1163793373330
Content-Type: text/plain; charset=WINDOWS-1252; format=flowed
Content-Transfer-Encoding: quoted-printable
Content-Disposition: inline

Hi Aarathi and Paul,

I tried it and it works. I'm kind of amazed at the apparent black arts
involved here - is it some sort of strange handling of pseudo-directory
paths in URLS? I notice the URL with the ?s works directly into a browser a=
s
well.

But I don't understand your comment paul. I wanted it to follow redirects s=
o
if default behaviour is to do so why do I need to replace / with ? in the
URLs?

Thanks and regards,
                   John

On 11/17/06, Paul King <paulk@asert.com.au> wrote:
>
> Rob Manthey wrote:
> > ok, a moment to learn something ... is this simply the final url (after
> > the 302 redirect) or is there something else going on here?
>
> The default behaviour is to follow redirects. If you want to visit
> the 302 page you have to turn redirects off among other things.
> I guess we should document this better as it arises quite frequently.
>
> Cheers,
>
> Paul.
>
> > on 17/11/06 11:49 Aarathi Niranjan said the following:
> >>
> >> Just a suggestion =85 this works for me =85 try it:
> >>
> >>
> >>
> >>             =85
> >>
> >> <steps>
> >>
> >>                         <invoke description=3D"ISIS SFF NZ search page=
"
> >> url=3D"
> https://flightbookings.airnewzealand.co.nz?isbook_en_NZ?book?initSearchFo=
rFlights.do
> "
> >> />
> >>
> >>             </steps>
> >>
> >>             =85
> >>
> >>
> >>
> >> Hope that helps.
> >>
> >>
> >>
> >>
> ------------------------------------------------------------------------
> >>
> >> *From:* webtest-admin@lists.canoo.com
> >> [mailto:webtest-admin@lists.canoo.com] *On Behalf Of *Charlie Kuharski
> >> *Sent:* Thursday, November 16, 2006 2:50 PM
> >> *To:* webtest@gate2.canoo.com
> >> *Subject:* Re: [Webtest] HTTP error 302
> >>
> >>
> >>
> >> Reaching via a browser is fine.  I can see it also.  Know that WebTest
> >> is build upon the HtmlUnit's API.
> >> As far as being reachable via HtmlUnit, this is only a guess, but I'm
> >> guessing the URL is passed through to be used by HtmlUnit.  So I'm
> >> guess it's the culprit.  There is a slight chance it's WebTest
> >> mangling the name somehow, but I doubt it.  Wouldn't know for sure
> >> until someone looks at the source.
> >> Try using the IP address instead.
> >>
> >> John and Pip wrote:
> >>
> >> Hi Charlie,
> >>
> >> Thanks for your response.
> >>
> >> Do you mean you couldn't reach
> >> https://flightbookings.airnewzealand.co.nz/isbook_en_NZ/book/initSearc=
hForFlights.do
>
> >> from a browser or that you think WebTest believes it is not reachable?
> >> This is the main public URL of the Air New Zealand flight booking
> >> engine, and we have a screen up in the office showing bookings coming
> >> through every minute!
> >>
> >> re testing with HTMLUnit: I'm not a java programmer - just a tester,
> >> trying to figure out whether I need to be a java programmer to use
> >> WebTest!
> >>
> >> Thanks for the hint re version number. I see this is R_1389. In fact
> >> to my embarrassment I see this even appears in my email below!
> >>
> >> regards,
> >>          John
> >>
> >> On 11/17/06, *Charlie Kuharski* <ckuharsk@nmdp.org
> >> <mailto:ckuharsk@nmdp.org>> wrote:
> >>
> >> Your host is not reachable.  I'm guessing it HtmlUnit.  Try using
> >> something without the "...co.nz". You could try and test with HtmlUnit=
.
> >> An ugly was to discover the version is to
> >>
> >> 1) replace your steps with this only:
> >>         <verifyTitle
> >>           description=3D"we should see the login title"
> >>           text=3D"Login Page" />
> >>
> >> 2) you should see something like:
> >> C:\test\Translink\gtest1.xml:12: Canoo Webtest: R_1393.
> >> Test failed.
> >> Exception raised: com.canoo.webtest.engine.StepExecutionException : No
> >> current response available! Is previous invoke miss
> >> itle at C:\test\Translink\gtest1.xml:30:  with (description=3D"we shou=
ld
> >> see the login title", taskName=3D"verifyTitle", text
> >> anoo.webtest.engine.StepExecutionException: No current response
> >> available! Is previous invoke missing?, Step: VerifyTitle
> >> nk\gtest1.xml:30:  with (description=3D"we should see the login title"=
,
> >> taskName=3D"verifyTitle", text=3D"Login Page")
> >>
> >> Good luck.
> >>
> >>
> >>
> >> John and Pip wrote:
> >>
> >> Hi,
> >>
> >> I have a test that is failing to follow a 302 error. I've searched the
> >> archives and played around trying to enable redirects but nothing
> >> seems to work.
> >>
> >> Below is the stripped-down test (just one invoke) and the output. This
> >> is a publicly available page so you can hit
> >> https://flightbookings.airnewzealand.co.nz/isbook_en_NZ/book/initSearc=
hForFlights.do
>
> >> from either IE or Firefox so I'm hoping someone can help me figure out
> >> how to hit this page from WebTest! Note that I've tried an internal
> >> page that is http rather than https and get the same problem so it
> >> isn't related to SSL.
> >>
> >> I am using Java 1.5.0.6 <http://1.5.0.6>, HTMLUnit 1.10 and WebTest
> >> R_1393 (I think! How can I verify this?).
> >>
> >> Regards,
> >>
> >>         John
> >>
> >> <?xml version=3D"1.0"?>
> >>
> >> <!DOCTYPE project SYSTEM "WebTest.dtd">
> >>
> >> <project name=3D"OLH" basedir=3D"." default=3D"main">
> >>
> >>     <property name=3D"webtest.home" location=3D"..\.."/>
> >>
> >>     <import file=3D"${ webtest.home}/lib/taskdef.xml"/>
> >>
> >>     <target name=3D"main">
> >>
> >>             <webtest name=3D"ISIS SFF NZ Search">
> >>
> >>                         <steps>
> >>
> >>                                                 <invoke
> >> description=3D"ISIS SFF NZ search page" url=3D"
> >>
> https://flightbookings.airnewzealand.co.nz/isbook_en_NZ/book/initSearchFo=
rFlights.do
> "
> >> />
> >>
> >>                                     </steps>
> >>
> >>                         </webtest>
> >>
> >>             </target>
> >>
> >> </project>
> >>
> >>
> >>
> >> Here is the output:
> >>
> >>
> >>
> >> <?xml version=3D" 1.0" encoding=3D"UTF-8"?>
> >>
> >> <summary Implementation-Title=3D"Canoo Webtest"
> >> Implementation-Version=3D"R_1389">
> >>
> >>     <testresult endtime=3D"Fri Nov 17 09:25:42 NZDT 2006"
> >>
> >>         location=3D"F:\WebTest\doc\ISIS\tempTest.xml:7: " starttime=3D=
"Fri
> >> Nov 17 09:25:40 NZDT 2006"
> >>
> >>         successful=3D"no" testspecname=3D"ISIS SFF NZ Search">
> >>
> >>         <config>
> >>
> >>             [snipped because I give the full URL below =96 get same
> >> result if set up config properly including port 443]
> >>
> >>         </config>
> >>
> >>         <results>
> >>
> >>             <step>
> >>
> >>                 <parameter name=3D"description" value=3D"ISIS SFF NZ
> >> search page"/>
> >>
> >>                 <parameter name=3D"method" value=3D"GET"/>
> >>
> >>                 <parameter name=3D"resultFilename"
> >> value=3D"response_1163708742276_invoke.html"/>
> >>
> >>                 <parameter name=3D"taskName" value=3D"invoke"/>
> >>
> >>                 <parameter name=3D"url"
> >> value=3D"https://flightbookings.airnewzealand.co.nz/isbook_en_NZ/book/=
initSearchForFlights.do
> >> <https://flightbookings.airnewzealand.co.nz/isbook_en_NZ/book/initSear=
chForFlights.do
> >"/>
> >>
> >>
> >>                 <result>
> >>
> >>                     <failed duration=3D"1469"/>
> >>
> >>                 </result>
> >>
> >>                 <htmlparser>
> >>
> >>                     <error col=3D"1" line=3D"1" url=3D"
> >>
> https://flightbookings.airnewzealand.co.nz/isbook_en_NZ/book/initSearchFo=
rFlights.do
> ">Empty
> >> document.</error>
> >>
> >>                 </htmlparser>
> >>
> >>             </step>
> >>
> >>             <failure
> >> message=3D"com.canoo.webtest.engine.StepFailedException: Step[invoke
> >> &quot;ISIS SFF NZ search page&quot; (1/1)]: HTTP error 302, at:
> >> invoke, Step: InvokePage at F:\WebTest\doc\ISIS\tempTest.xml:9:  with
> >> (description=3D&quot;ISIS SFF NZ search page&quot;,
> >> method=3D&quot;GET&quot;,
> >> resultFilename=3D&quot;response_1163708742276_invoke.html&quot;,
> >> taskName=3D&quot;invoke&quot;,
> >>
> url=3D&quot;https://flightbookings.airnewzealand.co.nz/isbook_en_NZ/book/=
initSearchForFlights.do&quot
> >> <https://flightbookings.airnewzealand.co.nz/isbook_en_NZ/book/initSear=
chForFlights.do&quot
> >;)"/>
> >>
> >>         </results>
> >>
> >>     </testresult>
> >>
> >> </summary>
> >>
> >>
> >>
> >>
> >>
>
> _______________________________________________
> WebTest mailing list
> WebTest@lists.canoo.com
> http://lists.canoo.com/mailman/listinfo/webtest
>

------=_Part_31759_21583170.1163793373330
Content-Type: text/html; charset=WINDOWS-1252
Content-Transfer-Encoding: quoted-printable
Content-Disposition: inline

Hi Aarathi and Paul,<br><br>I tried it and it works. I'm kind of amazed at =
the apparent black arts involved here - is it some sort of strange handling=
 of pseudo-directory paths in URLS? I notice the URL with the ?s works dire=
ctly into a browser as well.
<br><br>But I don't understand your comment paul. I wanted it to follow red=
irects so if default behaviour is to do so why do I need to replace / with =
? in the URLs?<br><br>Thanks and regards,<br>&nbsp;&nbsp;&nbsp;&nbsp;&nbsp;=
&nbsp;&nbsp;&nbsp;&nbsp;&nbsp;&nbsp;&nbsp;&nbsp;&nbsp;&nbsp;&nbsp;&nbsp;&nb=
sp; John<br>
<br><div><span class=3D"gmail_quote">On 11/17/06, <b class=3D"gmail_sendern=
ame">
Paul King</b> &lt;<a href=3D"mailto:paulk@asert.com.au" target=3D"_blank" o=
nclick=3D"return top.js.OpenExtLink(window,event,this)">paulk@asert.com.au<=
/a>&gt; wrote:</span><blockquote class=3D"gmail_quote" style=3D"border-left=
: 1px solid rgb(204, 204, 204); margin: 0pt 0pt 0pt 0.8ex; padding-left: 1e=
x;">

Rob Manthey wrote:<br>&gt; ok, a moment to learn something ... is this simp=
ly the final url (after<br>&gt; the 302 redirect) or is there something els=
e going on here?<br><br>The default behaviour is to follow redirects. If yo=
u want to visit
<br>the 302 page you have to turn redirects off among other things.<br>I gu=
ess we should document this better as it arises quite frequently.<br><br>Ch=
eers,<br><br>Paul.<br><br>&gt; on 17/11/06 11:49 Aarathi Niranjan said the =
following:
<br>&gt;&gt;<br>&gt;&gt; Just a suggestion =85 this works for me =85 try it=
:<br>&gt;&gt;<br>&gt;&gt;<br>&gt;&gt;<br>&gt;&gt;&nbsp;&nbsp;&nbsp;&nbsp;&n=
bsp;&nbsp;&nbsp;&nbsp;&nbsp;&nbsp;&nbsp;&nbsp; =85<br>&gt;&gt;<br>&gt;&gt; =
&lt;steps&gt;<br>&gt;&gt;<br>&gt;&gt;&nbsp;&nbsp;&nbsp;&nbsp;&nbsp;&nbsp;&n=
bsp;&nbsp;&nbsp;&nbsp;&nbsp;&nbsp;&nbsp;&nbsp;&nbsp;&nbsp;&nbsp;&nbsp;&nbsp=
;&nbsp;&nbsp;&nbsp;&nbsp;&nbsp; &lt;invoke description=3D&quot;ISIS SFF NZ =
search page&quot;
<br>&gt;&gt; url=3D&quot;<a href=3D"https://flightbookings.airnewzealand.co=
.nz?isbook_en_NZ?book?initSearchForFlights.do" target=3D"_blank" onclick=3D=
"return top.js.OpenExtLink(window,event,this)">https://flightbookings.airne=
wzealand.co.nz?isbook_en_NZ?book?initSearchForFlights.do
</a>&quot;<br>&gt;&gt; /&gt;
<br>&gt;&gt;<br>&gt;&gt;&nbsp;&nbsp;&nbsp;&nbsp;&nbsp;&nbsp;&nbsp;&nbsp;&nb=
sp;&nbsp;&nbsp;&nbsp; &lt;/steps&gt;<br>&gt;&gt;<br>&gt;&gt;&nbsp;&nbsp;&nb=
sp;&nbsp;&nbsp;&nbsp;&nbsp;&nbsp;&nbsp;&nbsp;&nbsp;&nbsp; =85<br>&gt;&gt;<b=
r>&gt;&gt;<br>&gt;&gt;<br>&gt;&gt; Hope that helps.<br>&gt;&gt;<br>&gt;&gt;=
<br>&gt;&gt;<br>&gt;&gt; --------------------------------------------------=
----------------------
<br>&gt;&gt;<br>&gt;&gt; *From:* <a href=3D"mailto:webtest-admin@lists.cano=
o.com" target=3D"_blank" onclick=3D"return top.js.OpenExtLink(window,event,=
this)">webtest-admin@lists.canoo.com</a><br>&gt;&gt; [mailto:<a href=3D"mai=
lto:webtest-admin@lists.canoo.com" target=3D"_blank" onclick=3D"return top.=
js.OpenExtLink(window,event,this)">
webtest-admin@lists.canoo.com</a>] *On Behalf Of *Charlie Kuharski
<br>&gt;&gt; *Sent:* Thursday, November 16, 2006 2:50 PM<br>&gt;&gt; *To:* =
<a href=3D"mailto:webtest@gate2.canoo.com" target=3D"_blank" onclick=3D"ret=
urn top.js.OpenExtLink(window,event,this)">webtest@gate2.canoo.com</a><br>&=
gt;&gt; *Subject:* Re: [Webtest] HTTP error 302
<br>&gt;&gt;<br>&gt;&gt;<br>
&gt;&gt;<br>&gt;&gt; Reaching via a browser is fine.&nbsp;&nbsp;I can see i=
t also.&nbsp;&nbsp;Know that WebTest<br>&gt;&gt; is build upon the HtmlUnit=
's API.<br>&gt;&gt; As far as being reachable via HtmlUnit, this is only a =
guess, but I'm<br>

&gt;&gt; guessing the URL is passed through to be used by HtmlUnit.&nbsp;&n=
bsp;So I'm<br>&gt;&gt; guess it's the culprit.&nbsp;&nbsp;There is a slight=
 chance it's WebTest<br>&gt;&gt; mangling the name somehow, but I doubt it.=
&nbsp;&nbsp;Wouldn't know for sure
<br>&gt;&gt; until someone looks at the source.<br>&gt;&gt; Try using the I=
P address instead.<br>&gt;&gt;<br>&gt;&gt; John and Pip wrote:<br>&gt;&gt;<=
br>&gt;&gt; Hi Charlie,<br>&gt;&gt;<br>&gt;&gt; Thanks for your response.
<br>&gt;&gt;<br>&gt;&gt; Do you mean you couldn't reach<br>&gt;&gt; <a href=
=3D"https://flightbookings.airnewzealand.co.nz/isbook_en_NZ/book/initSearch=
ForFlights.do" target=3D"_blank" onclick=3D"return top.js.OpenExtLink(windo=
w,event,this)">
https://flightbookings.airnewzealand.co.nz/isbook_en_NZ/book/initSearchForF=
lights.do
</a><br>&gt;&gt; from a browser or that you think WebTest believes it is no=
t reachable?<br>&gt;&gt; This is the main public URL of the Air New Zealand=
 flight booking<br>&gt;&gt; engine, and we have a screen up in the office s=
howing bookings coming
<br>&gt;&gt; through every minute!<br>&gt;&gt;<br>&gt;&gt; re testing with =
HTMLUnit: I'm not a java programmer - just a tester,<br>&gt;&gt; trying to =
figure out whether I need to be a java programmer to use<br>&gt;&gt; WebTes=
t!
<br>&gt;&gt;<br>&gt;&gt; Thanks for the hint re version number. I see this =
is R_1389. In fact<br>&gt;&gt; to my embarrassment I see this even appears =
in my email below!<br>&gt;&gt;<br>&gt;&gt; regards,<br>&gt;&gt;&nbsp;&nbsp;=
&nbsp;&nbsp;&nbsp;&nbsp;&nbsp;&nbsp;&nbsp;&nbsp;John
<br>&gt;&gt;<br>&gt;&gt; On 11/17/06, *Charlie Kuharski* &lt;<a href=3D"mai=
lto:ckuharsk@nmdp.org" target=3D"_blank" onclick=3D"return top.js.OpenExtLi=
nk(window,event,this)">ckuharsk@nmdp.org</a><br>&gt;&gt; &lt;mailto:<a href=
=3D"mailto:ckuharsk@nmdp.org" target=3D"_blank" onclick=3D"return top.js.Op=
enExtLink(window,event,this)">
ckuharsk@nmdp.org</a>&gt;&gt; wrote:<br>&gt;&gt;
<br>&gt;&gt; Your host is not reachable.&nbsp;&nbsp;I'm guessing it HtmlUni=
t.&nbsp;&nbsp;Try using<br>&gt;&gt; something without the &quot;...co.nz&qu=
ot;. You could try and test with HtmlUnit.<br>&gt;&gt; An ugly was to disco=
ver the version is to
<br>&gt;&gt;<br>&gt;&gt; 1) replace your steps with this only:<br>&gt;&gt;&=
nbsp;&nbsp;&nbsp;&nbsp;&nbsp;&nbsp;&nbsp;&nbsp; &lt;verifyTitle<br>&gt;&gt;=
&nbsp;&nbsp;&nbsp;&nbsp;&nbsp;&nbsp;&nbsp;&nbsp;&nbsp;&nbsp; description=3D=
&quot;we should see the login title&quot;<br>&gt;&gt;&nbsp;&nbsp;&nbsp;&nbs=
p;&nbsp;&nbsp;&nbsp;&nbsp;&nbsp;&nbsp; text=3D&quot;Login Page&quot; /&gt;
<br>&gt;&gt;<br>&gt;&gt; 2) you should see something like:<br>&gt;&gt; C:\t=
est\Translink\gtest1.xml:12: Canoo Webtest: R_1393.<br>&gt;&gt; Test failed=
.<br>&gt;&gt; Exception raised: com.canoo.webtest.engine.StepExecutionExcep=
tion

: No<br>&gt;&gt; current response available! Is previous invoke miss<br>&gt=
;&gt; itle at C:\test\Translink\gtest1.xml:30:&nbsp;&nbsp;with (description=
=3D&quot;we should<br>&gt;&gt; see the login title&quot;, taskName=3D&quot;=
verifyTitle&quot;, text
<br>&gt;&gt; anoo.webtest.engine.StepExecutionException: No current respons=
e<br>&gt;&gt; available! Is previous invoke missing?, Step: VerifyTitle<br>=
&gt;&gt; nk\gtest1.xml:30:&nbsp;&nbsp;with (description=3D&quot;we should s=
ee the login title&quot;,
<br>&gt;&gt; taskName=3D&quot;verifyTitle&quot;, text=3D&quot;Login Page&qu=
ot;)<br>&gt;&gt;<br>&gt;&gt; Good luck.<br>&gt;&gt;<br>&gt;&gt;<br>&gt;&gt;=
<br>&gt;&gt; John and Pip wrote:<br>&gt;&gt;<br>&gt;&gt; Hi,<br>&gt;&gt;<br=
>

&gt;&gt; I have a test that is failing to follow a 302 error. I've searched=
 the<br>&gt;&gt; archives and played around trying to enable redirects but =
nothing<br>&gt;&gt; seems to work.<br>&gt;&gt;<br>&gt;&gt; Below is the str=
ipped-down test (just one invoke) and the output. This
<br>&gt;&gt; is a publicly available page so you can hit<br>&gt;&gt; <a hre=
f=3D"https://flightbookings.airnewzealand.co.nz/isbook_en_NZ/book/initSearc=
hForFlights.do" target=3D"_blank" onclick=3D"return top.js.OpenExtLink(wind=
ow,event,this)">
https://flightbookings.airnewzealand.co.nz/isbook_en_NZ/book/initSearchForF=
lights.do
</a><br>&gt;&gt; from either IE or Firefox so I'm hoping someone can help m=
e figure out<br>&gt;&gt; how to hit this page from WebTest! Note that I've =
tried an internal<br>&gt;&gt; page that is http rather than https and get t=
he same problem so it
<br>&gt;&gt; isn't related to SSL.<br>&gt;&gt;<br>&gt;&gt; I am using Java =
<a href=3D"http://1.5.0.6" target=3D"_blank" onclick=3D"return top.js.OpenE=
xtLink(window,event,this)">1.5.0.6</a> &lt;<a href=3D"http://1.5.0.6" targe=
t=3D"_blank" onclick=3D"return top.js.OpenExtLink(window,event,this)">
http://1.5.0.6</a>&gt;, HTMLUnit 1.10 and WebTest<br>&gt;&gt; R_1393 (I thi=
nk! How can I verify this?).
<br>&gt;&gt;<br>&gt;&gt; Regards,<br>&gt;&gt;<br>&gt;&gt;&nbsp;&nbsp;&nbsp;=
&nbsp;&nbsp;&nbsp;&nbsp;&nbsp; John<br>&gt;&gt;<br>&gt;&gt; &lt;?xml versio=
n=3D&quot;1.0&quot;?&gt;<br>&gt;&gt;<br>&gt;&gt; &lt;!DOCTYPE project SYSTE=
M &quot;WebTest.dtd&quot;&gt;<br>&gt;&gt;
<br>&gt;&gt; &lt;project name=3D&quot;OLH&quot; basedir=3D&quot;.&quot; def=
ault=3D&quot;main&quot;&gt;<br>&gt;&gt;<br>&gt;&gt;&nbsp;&nbsp;&nbsp;&nbsp;=
 &lt;property name=3D&quot;webtest.home&quot; location=3D&quot;..\..&quot;/=
&gt;<br>&gt;&gt;<br>&gt;&gt;&nbsp;&nbsp;&nbsp;&nbsp; &lt;import file=3D&quo=
t;${
webtest.home}/lib/taskdef.xml&quot;/&gt;<br>&gt;&gt;<br>&gt;&gt;&nbsp;&nbsp=
;&nbsp;&nbsp; &lt;target name=3D&quot;main&quot;&gt;<br>&gt;&gt;<br>&gt;&gt=
;&nbsp;&nbsp;&nbsp;&nbsp;&nbsp;&nbsp;&nbsp;&nbsp;&nbsp;&nbsp;&nbsp;&nbsp; &=
lt;webtest name=3D&quot;ISIS SFF NZ Search&quot;&gt;<br>&gt;&gt;<br>&gt;&gt=
;&nbsp;&nbsp;&nbsp;&nbsp;&nbsp;&nbsp;&nbsp;&nbsp;&nbsp;&nbsp;&nbsp;&nbsp;&n=
bsp;&nbsp;&nbsp;&nbsp;&nbsp;&nbsp;&nbsp;&nbsp;&nbsp;&nbsp;&nbsp;&nbsp; &lt;=
steps&gt;
<br>&gt;&gt;<br>&gt;&gt;&nbsp;&nbsp;&nbsp;&nbsp;&nbsp;&nbsp;&nbsp;&nbsp;&nb=
sp;&nbsp;&nbsp;&nbsp;&nbsp;&nbsp;&nbsp;&nbsp;&nbsp;&nbsp;&nbsp;&nbsp;&nbsp;=
&nbsp;&nbsp;&nbsp;&nbsp;&nbsp;&nbsp;&nbsp;&nbsp;&nbsp;&nbsp;&nbsp;&nbsp;&nb=
sp;&nbsp;&nbsp;&nbsp;&nbsp;&nbsp;&nbsp;&nbsp;&nbsp;&nbsp;&nbsp;&nbsp;&nbsp;=
&nbsp;&nbsp; &lt;invoke<br>&gt;&gt; description=3D&quot;ISIS SFF NZ search =
page&quot; url=3D&quot;<br>&gt;&gt; <a href=3D"https://flightbookings.airne=
wzealand.co.nz/isbook_en_NZ/book/initSearchForFlights.do" target=3D"_blank"=
 onclick=3D"return top.js.OpenExtLink(window,event,this)">

https://flightbookings.airnewzealand.co.nz/isbook_en_NZ/book/initSearchForF=
lights.do</a>&quot;<br>&gt;&gt; /&gt;<br>&gt;&gt;<br>&gt;&gt;&nbsp;&nbsp;&n=
bsp;&nbsp;&nbsp;&nbsp;&nbsp;&nbsp;&nbsp;&nbsp;&nbsp;&nbsp;&nbsp;&nbsp;&nbsp=
;&nbsp;&nbsp;&nbsp;&nbsp;&nbsp;&nbsp;&nbsp;&nbsp;&nbsp;&nbsp;&nbsp;&nbsp;&n=
bsp;&nbsp;&nbsp;&nbsp;&nbsp;&nbsp;&nbsp;&nbsp;&nbsp; &lt;/steps&gt;<br>&gt;=
&gt;<br>&gt;&gt;&nbsp;&nbsp;&nbsp;&nbsp;&nbsp;&nbsp;&nbsp;&nbsp;&nbsp;&nbsp=
;&nbsp;&nbsp;&nbsp;&nbsp;&nbsp;&nbsp;&nbsp;&nbsp;&nbsp;&nbsp;&nbsp;&nbsp;&n=
bsp;&nbsp; &lt;/webtest&gt;
<br>&gt;&gt;<br>&gt;&gt;&nbsp;&nbsp;&nbsp;&nbsp;&nbsp;&nbsp;&nbsp;&nbsp;&nb=
sp;&nbsp;&nbsp;&nbsp; &lt;/target&gt;<br>&gt;&gt;<br>&gt;&gt; &lt;/project&=
gt;<br>&gt;&gt;<br>&gt;&gt;<br>&gt;&gt;<br>&gt;&gt; Here is the output:<br>=
&gt;&gt;<br>&gt;&gt;<br>&gt;&gt;<br>&gt;&gt; &lt;?xml version=3D&quot;
1.0&quot; encoding=3D&quot;UTF-8&quot;?&gt;<br>&gt;&gt;<br>&gt;&gt; &lt;sum=
mary Implementation-Title=3D&quot;Canoo Webtest&quot;<br>&gt;&gt; Implement=
ation-Version=3D&quot;R_1389&quot;&gt;<br>&gt;&gt;<br>&gt;&gt;&nbsp;&nbsp;&=
nbsp;&nbsp; &lt;testresult endtime=3D&quot;Fri Nov 17 09:25:42 NZDT 2006&qu=
ot;
<br>&gt;&gt;<br>&gt;&gt;&nbsp;&nbsp;&nbsp;&nbsp;&nbsp;&nbsp;&nbsp;&nbsp; lo=
cation=3D&quot;F:\WebTest\doc\ISIS\tempTest.xml:7: &quot; starttime=3D&quot=
;Fri<br>&gt;&gt; Nov 17 09:25:40 NZDT 2006&quot;<br>&gt;&gt;<br>&gt;&gt;&nb=
sp;&nbsp;&nbsp;&nbsp;&nbsp;&nbsp;&nbsp;&nbsp; successful=3D&quot;no&quot; t=
estspecname=3D&quot;ISIS SFF NZ Search&quot;&gt;
<br>&gt;&gt;<br>&gt;&gt;&nbsp;&nbsp;&nbsp;&nbsp;&nbsp;&nbsp;&nbsp;&nbsp; &l=
t;config&gt;<br>&gt;&gt;<br>&gt;&gt;&nbsp;&nbsp;&nbsp;&nbsp;&nbsp;&nbsp;&nb=
sp;&nbsp;&nbsp;&nbsp;&nbsp;&nbsp; [snipped because I give the full URL belo=
w =96 get same<br>&gt;&gt; result if set up config properly including port =
443]<br>&gt;&gt;<br>&gt;&gt;&nbsp;&nbsp;&nbsp;&nbsp;&nbsp;&nbsp;&nbsp;&nbsp=
; &lt;/config&gt;
<br>&gt;&gt;<br>&gt;&gt;&nbsp;&nbsp;&nbsp;&nbsp;&nbsp;&nbsp;&nbsp;&nbsp; &l=
t;results&gt;<br>&gt;&gt;<br>&gt;&gt;&nbsp;&nbsp;&nbsp;&nbsp;&nbsp;&nbsp;&n=
bsp;&nbsp;&nbsp;&nbsp;&nbsp;&nbsp; &lt;step&gt;<br>&gt;&gt;<br>&gt;&gt;&nbs=
p;&nbsp;&nbsp;&nbsp;&nbsp;&nbsp;&nbsp;&nbsp;&nbsp;&nbsp;&nbsp;&nbsp;&nbsp;&=
nbsp;&nbsp;&nbsp; &lt;parameter name=3D&quot;description&quot; value=3D&quo=
t;ISIS SFF NZ<br>&gt;&gt; search page&quot;/&gt;
<br>&gt;&gt;<br>&gt;&gt;&nbsp;&nbsp;&nbsp;&nbsp;&nbsp;&nbsp;&nbsp;&nbsp;&nb=
sp;&nbsp;&nbsp;&nbsp;&nbsp;&nbsp;&nbsp;&nbsp; &lt;parameter name=3D&quot;me=
thod&quot; value=3D&quot;GET&quot;/&gt;<br>&gt;&gt;<br>&gt;&gt;&nbsp;&nbsp;=
&nbsp;&nbsp;&nbsp;&nbsp;&nbsp;&nbsp;&nbsp;&nbsp;&nbsp;&nbsp;&nbsp;&nbsp;&nb=
sp;&nbsp; &lt;parameter name=3D&quot;resultFilename&quot;<br>&gt;&gt; value=
=3D&quot;response_1163708742276_invoke.html&quot;/&gt;
<br>&gt;&gt;<br>&gt;&gt;&nbsp;&nbsp;&nbsp;&nbsp;&nbsp;&nbsp;&nbsp;&nbsp;&nb=
sp;&nbsp;&nbsp;&nbsp;&nbsp;&nbsp;&nbsp;&nbsp; &lt;parameter name=3D&quot;ta=
skName&quot; value=3D&quot;invoke&quot;/&gt;<br>&gt;&gt;<br>&gt;&gt;&nbsp;&=
nbsp;&nbsp;&nbsp;&nbsp;&nbsp;&nbsp;&nbsp;&nbsp;&nbsp;&nbsp;&nbsp;&nbsp;&nbs=
p;&nbsp;&nbsp; &lt;parameter name=3D&quot;url&quot;<br>&gt;&gt; value=3D&qu=
ot;<a href=3D"https://flightbookings.airnewzealand.co.nz/isbook_en_NZ/book/=
initSearchForFlights.do" target=3D"_blank" onclick=3D"return top.js.OpenExt=
Link(window,event,this)">

https://flightbookings.airnewzealand.co.nz/isbook_en_NZ/book/initSearchForF=
lights.do</a><br>&gt;&gt; &lt;<a href=3D"https://flightbookings.airnewzeala=
nd.co.nz/isbook_en_NZ/book/initSearchForFlights.do" target=3D"_blank" oncli=
ck=3D"return top.js.OpenExtLink(window,event,this)">
https://flightbookings.airnewzealand.co.nz/isbook_en_NZ/book/initSearchForF=
lights.do
</a>&gt;&quot;/&gt;<br>&gt;&gt;<br>&gt;&gt;<br>&gt;&gt;&nbsp;&nbsp;&nbsp;&n=
bsp;&nbsp;&nbsp;&nbsp;&nbsp;&nbsp;&nbsp;&nbsp;&nbsp;&nbsp;&nbsp;&nbsp;&nbsp=
; &lt;result&gt;<br>&gt;&gt;<br>&gt;&gt;&nbsp;&nbsp;&nbsp;&nbsp;&nbsp;&nbsp=
;&nbsp;&nbsp;&nbsp;&nbsp;&nbsp;&nbsp;&nbsp;&nbsp;&nbsp;&nbsp;&nbsp;&nbsp;&n=
bsp;&nbsp; &lt;failed duration=3D&quot;1469&quot;/&gt;<br>&gt;&gt;<br>&gt;&=
gt;&nbsp;&nbsp;&nbsp;&nbsp;&nbsp;&nbsp;&nbsp;&nbsp;&nbsp;&nbsp;&nbsp;&nbsp;=
&nbsp;&nbsp;&nbsp;&nbsp; &lt;/result&gt;
<br>&gt;&gt;<br>&gt;&gt;&nbsp;&nbsp;&nbsp;&nbsp;&nbsp;&nbsp;&nbsp;&nbsp;&nb=
sp;&nbsp;&nbsp;&nbsp;&nbsp;&nbsp;&nbsp;&nbsp; &lt;htmlparser&gt;<br>&gt;&gt=
;<br>&gt;&gt;&nbsp;&nbsp;&nbsp;&nbsp;&nbsp;&nbsp;&nbsp;&nbsp;&nbsp;&nbsp;&n=
bsp;&nbsp;&nbsp;&nbsp;&nbsp;&nbsp;&nbsp;&nbsp;&nbsp;&nbsp; &lt;error col=3D=
&quot;1&quot; line=3D&quot;1&quot; url=3D&quot;<br>&gt;&gt; <a href=3D"http=
s://flightbookings.airnewzealand.co.nz/isbook_en_NZ/book/initSearchForFligh=
ts.do" target=3D"_blank" onclick=3D"return top.js.OpenExtLink(window,event,=
this)">

https://flightbookings.airnewzealand.co.nz/isbook_en_NZ/book/initSearchForF=
lights.do</a>&quot;&gt;Empty<br>&gt;&gt; document.&lt;/error&gt;<br>&gt;&gt=
;<br>&gt;&gt;&nbsp;&nbsp;&nbsp;&nbsp;&nbsp;&nbsp;&nbsp;&nbsp;&nbsp;&nbsp;&n=
bsp;&nbsp;&nbsp;&nbsp;&nbsp;&nbsp; &lt;/htmlparser&gt;<br>&gt;&gt;<br>&gt;&=
gt;&nbsp;&nbsp;&nbsp;&nbsp;&nbsp;&nbsp;&nbsp;&nbsp;&nbsp;&nbsp;&nbsp;&nbsp;=
 &lt;/step&gt;
<br>&gt;&gt;<br>&gt;&gt;&nbsp;&nbsp;&nbsp;&nbsp;&nbsp;&nbsp;&nbsp;&nbsp;&nb=
sp;&nbsp;&nbsp;&nbsp; &lt;failure<br>&gt;&gt; message=3D&quot;com.canoo.web=
test.engine.StepFailedException: Step[invoke<br>&gt;&gt; &amp;quot;ISIS SFF=
 NZ search page&amp;quot; (1/1)]: HTTP error 302, at:<br>
&gt;&gt; invoke, Step: InvokePage at F:\WebTest\doc\ISIS\tempTest.xml:9:&nb=
sp;&nbsp;with
<br>&gt;&gt; (description=3D&amp;quot;ISIS SFF NZ search page&amp;quot;,<br=
>&gt;&gt; method=3D&amp;quot;GET&amp;quot;,<br>&gt;&gt; resultFilename=3D&a=
mp;quot;response_1163708742276_invoke.html&amp;quot;,<br>&gt;&gt; taskName=
=3D&amp;quot;invoke&amp;quot;,
<br>&gt;&gt; url=3D&amp;quot;https://flightbookings.airnewzealand.co.nz/isb=
ook_en_NZ/book/initSearchForFlights.do&amp;quot<br>&gt;&gt; &lt;<a href=3D"=
https://flightbookings.airnewzealand.co.nz/isbook_en_NZ/book/initSearchForF=
lights.do&amp;quot" target=3D"_blank" onclick=3D"return top.js.OpenExtLink(=
window,event,this)">

https://flightbookings.airnewzealand.co.nz/isbook_en_NZ/book/initSearchForF=
lights.do&amp;quot</a>&gt;;)&quot;/&gt;<br>&gt;&gt;<br>&gt;&gt;&nbsp;&nbsp;=
&nbsp;&nbsp;&nbsp;&nbsp;&nbsp;&nbsp; &lt;/results&gt;<br>&gt;&gt;<br>&gt;&g=
t;&nbsp;&nbsp;&nbsp;&nbsp; &lt;/testresult&gt;<br>&gt;&gt;
<br>&gt;&gt; &lt;/summary&gt;<br>&gt;&gt;<br>&gt;&gt;<br>&gt;&gt;<br>&gt;&g=
t;<br>&gt;&gt;<br><br>_______________________________________________<br>We=
bTest mailing list<br><a href=3D"mailto:WebTest@lists.canoo.com" target=3D"=
_blank" onclick=3D"return top.js.OpenExtLink(window,event,this)">
WebTest@lists.canoo.com
</a><br><a href=3D"http://lists.canoo.com/mailman/listinfo/webtest" target=
=3D"_blank" onclick=3D"return top.js.OpenExtLink(window,event,this)">http:/=
/lists.canoo.com/mailman/listinfo/webtest</a><br></blockquote></div><br>


------=_Part_31759_21583170.1163793373330--