[Webtest] RE: AppletRunner: java.lang.NoSuchMethodException

Yuri Glickman Yuri Glickman" <glickman@rambler.ru
Fri, 12 Sep 2008 16:41:11 +0200


Dies ist eine mehrteilige Nachricht im MIME-Format.

------=_NextPart_000_0016_01C914F6.5DD68520
Content-Type: text/plain;
	charset="koi8-r"
Content-Transfer-Encoding: 7bit

 

Dear All,

 

I am trying to test a platform which provides an applet interface. From
Webtest I receive an error with exit value: -3.

The log says that it cannot  find the applet's method <init>. The applet for
sure has it and it works fine in any browser.

 

Please, help. Maybe, I do something wrong:

Many thanks in advance.

 

Here my xml file and the log:

 

<?xml version="1.0"?>

<!DOCTYPE project SYSTEM "../dtd/Project.dtd">

<project default="test">

                <target name="test">

                               <webtest name="check that eMayor Aachen is
up">

                                               <steps>

                                                               <invoke
url="http://192.168.222.131:8080/eMayor2.0/login.do?municipalityNameKey=Name
.Aachen" description="Go to eMayor Aachen"/>

                                                               <verifyTitle
text="eMayor Login" />

                                                               <appletRunner


 
scenario="LoginButtonApplet" 

 
xpath="/html/body/table/tbody/tr/td/table/tbody/tr/td/table/tbody/tr/td/p/ap
plet">

 
</appletRunner>

                                               </steps>

                               </webtest>

                </target>

</project>

 

 

The error from the log info:

 

 [appletRunner] 'com.canoo.webtest.extension.applet.runner.AppletRunner'


[appletRunner] 'C:\DOKUME~1\ygl\LOKALE~1\Temp\AppletPlugin32537.arguments'


[appletRunner]


[appletRunner] The ' characters around the executable and arguments are


[appletRunner] not part of the command.


[appletRunner]


[appletRunner] Using org.netbeans.jemmy.drivers.DefaultDriverInstaller
driver installer                                 

[appletRunner]  INFO
(com.canoo.webtest.extension.applet.runner.http.HttpURLConnection) -
getInputStream(http://192.168.

222.131:8080/eMayor2.0/LoginButtonApplet.class)


[appletRunner]  INFO
(com.canoo.webtest.extension.applet.runner.http.HttpURLConnection) -
connect(http://192.168.222.131

:8080/eMayor2.0/LoginButtonApplet.class)


[appletRunner]  INFO
(com.canoo.webtest.extension.applet.runner.http.HttpURLConnection) -
getInputStream(http://192.168.

222.131:8080/eMayor2.0/LoginButtonApplet.class)


[appletRunner]  INFO
(com.canoo.webtest.extension.applet.runner.http.HttpURLConnection) -
getHeaderField(content-length)

 -> 5550


[appletRunner] ERROR
(com.canoo.webtest.extension.applet.runner.AppletRunner) -
LoginButtonApplet.<init>(com.canoo.webte

st.extension.applet.runner.AppletRunner, java.awt.Frame)


[appletRunner] java.lang.NoSuchMethodException:
LoginButtonApplet.<init>(com.canoo.webtest.extension.applet.runner.Apple

tRunner, java.awt.Frame)


[appletRunner]  at java.lang.Class.getConstructor0(Unknown Source)

[appletRunner]  at java.lang.Class.getConstructor(Unknown Source)


[appletRunner]  at
com.canoo.webtest.extension.applet.runner.AppletRunner.createObject(AppletRu
nner.java:146)           

[appletRunner]  at
com.canoo.webtest.extension.applet.runner.AppletRunner.newScenario(AppletRun
ner.java:129)            

[appletRunner]  at
com.canoo.webtest.extension.applet.runner.AppletRunner.run(AppletRunner.java
:83)                     

[appletRunner]  at
com.canoo.webtest.extension.applet.runner.AppletRunner.main(AppletRunner.jav
a:62)                    

[appletRunner]  INFO (com.canoo.webtest.extension.applet.AppletRunnerStep) -
runApplet: exitValue was: -3               

[appletRunner] ERROR (com.canoo.webtest.extension.applet.AppletRunnerStep) -
Test LoginButtonApplet failed. Exit value: 

-3


 INFO (com.canoo.webtest.engine.WebClientContext) - Responses restored


 INFO (com.canoo.webtest.ant.WebtestTask) - Finished executing webtest
"check that eMayor Aachen is up" (C:\Work\Testing

\Canoo\myWebTestProject\tests\yglWebTest.xml:9: )


 INFO (com.canoo.webtest.reporting.XmlReporter) - Writing report to
C:\Work\Testing\Canoo\myWebTestProject\results\001_C

heckThatEMayorA\WebTestReport.xml


 INFO (com.canoo.webtest.ant.WebtestTask) - Test report successfully
created.                                           

 


 

:

 


BUILD FAILED


C:\Work\Testing\Canoo\build\webtest.xml:381: 1 of 1 webtests have failed (0
successful)!                                

 


Total time: 11 seconds



------=_NextPart_000_0016_01C914F6.5DD68520
Content-Type: text/html;
	charset="koi8-r"
Content-Transfer-Encoding: quoted-printable

<html xmlns:v=3D"urn:schemas-microsoft-com:vml" =
xmlns:o=3D"urn:schemas-microsoft-com:office:office" =
xmlns:w=3D"urn:schemas-microsoft-com:office:word" =
xmlns:x=3D"urn:schemas-microsoft-com:office:excel" =
xmlns:p=3D"urn:schemas-microsoft-com:office:powerpoint" =
xmlns:a=3D"urn:schemas-microsoft-com:office:access" =
xmlns:dt=3D"uuid:C2F41010-65B3-11d1-A29F-00AA00C14882" =
xmlns:s=3D"uuid:BDC6E3F0-6DA3-11d1-A2A3-00AA00C14882" =
xmlns:rs=3D"urn:schemas-microsoft-com:rowset" xmlns:z=3D"#RowsetSchema" =
xmlns:b=3D"urn:schemas-microsoft-com:office:publisher" =
xmlns:ss=3D"urn:schemas-microsoft-com:office:spreadsheet" =
xmlns:c=3D"urn:schemas-microsoft-com:office:component:spreadsheet" =
xmlns:oa=3D"urn:schemas-microsoft-com:office:activation" =
xmlns:html=3D"http://www.w3.org/TR/REC-html40" =
xmlns:q=3D"http://schemas.xmlsoap.org/soap/envelope/" xmlns:D=3D"DAV:" =
xmlns:x2=3D"http://schemas.microsoft.com/office/excel/2003/xml" =
xmlns:ois=3D"http://schemas.microsoft.com/sharepoint/soap/ois/" =
xmlns:dir=3D"http://schemas.microsoft.com/sharepoint/soap/directory/" =
xmlns:ds=3D"http://www.w3.org/2000/09/xmldsig#" =
xmlns:dsp=3D"http://schemas.microsoft.com/sharepoint/dsp" =
xmlns:udc=3D"http://schemas.microsoft.com/data/udc" =
xmlns:xsd=3D"http://www.w3.org/2001/XMLSchema" =
xmlns:sub=3D"http://schemas.microsoft.com/sharepoint/soap/2002/1/alerts/"=
 xmlns:ec=3D"http://www.w3.org/2001/04/xmlenc#" =
xmlns:sp=3D"http://schemas.microsoft.com/sharepoint/" =
xmlns:sps=3D"http://schemas.microsoft.com/sharepoint/soap/" =
xmlns:xsi=3D"http://www.w3.org/2001/XMLSchema-instance" =
xmlns:udcxf=3D"http://schemas.microsoft.com/data/udc/xmlfile" =
xmlns:wf=3D"http://schemas.microsoft.com/sharepoint/soap/workflow/" =
xmlns:mver=3D"http://schemas.openxmlformats.org/markup-compatibility/2006=
" xmlns:m=3D"http://schemas.microsoft.com/office/2004/12/omml" =
xmlns:mrels=3D"http://schemas.openxmlformats.org/package/2006/relationshi=
ps" =
xmlns:ex12t=3D"http://schemas.microsoft.com/exchange/services/2006/types"=
 =
xmlns:ex12m=3D"http://schemas.microsoft.com/exchange/services/2006/messag=
es" xmlns:Z=3D"urn:schemas-microsoft-com:" =
xmlns=3D"http://www.w3.org/TR/REC-html40">

<head>
<meta http-equiv=3DContent-Type content=3D"text/html; charset=3Dkoi8-r">
<meta name=3DGenerator content=3D"Microsoft Word 12 (filtered medium)">
<style>
<!--
 /* Font Definitions */
 @font-face
	{font-family:"Cambria Math";
	panose-1:2 4 5 3 5 4 6 3 2 4;}
@font-face
	{font-family:Calibri;
	panose-1:2 15 5 2 2 2 4 3 2 4;}
 /* Style Definitions */
 p.MsoNormal, li.MsoNormal, div.MsoNormal
	{margin:0cm;
	margin-bottom:.0001pt;
	font-size:11.0pt;
	font-family:"Calibri","sans-serif";}
a:link, span.MsoHyperlink
	{mso-style-priority:99;
	color:blue;
	text-decoration:underline;}
a:visited, span.MsoHyperlinkFollowed
	{mso-style-priority:99;
	color:purple;
	text-decoration:underline;}
span.E-MailFormatvorlage17
	{mso-style-type:personal;
	font-family:"Calibri","sans-serif";
	color:windowtext;}
span.E-MailFormatvorlage18
	{mso-style-type:personal-reply;
	font-family:"Calibri","sans-serif";
	color:#1F497D;}
.MsoChpDefault
	{mso-style-type:export-only;
	font-size:10.0pt;}
@page Section1
	{size:612.0pt 792.0pt;
	margin:2.0cm 42.5pt 2.0cm 3.0cm;}
div.Section1
	{page:Section1;}
-->
</style>
<!--[if gte mso 9]><xml>
 <o:shapedefaults v:ext=3D"edit" spidmax=3D"1026" />
</xml><![endif]--><!--[if gte mso 9]><xml>
 <o:shapelayout v:ext=3D"edit">
  <o:idmap v:ext=3D"edit" data=3D"1" />
 </o:shapelayout></xml><![endif]-->
</head>

<body lang=3DDE link=3Dblue vlink=3Dpurple>

<div class=3DSection1>

<p class=3DMsoNormal><o:p>&nbsp;</o:p></p>

<p class=3DMsoNormal><span lang=3DEN-US>Dear All,<o:p></o:p></span></p>

<p class=3DMsoNormal><span lang=3DEN-US><o:p>&nbsp;</o:p></span></p>

<p class=3DMsoNormal><span lang=3DEN-US>I am trying to test a platform =
which
provides an applet interface. From Webtest I receive an error with exit =
value:
-3.<o:p></o:p></span></p>

<p class=3DMsoNormal><span lang=3DEN-US>The log says that it =
cannot&nbsp; find the
applet&#8217;s method &lt;init&gt;. The applet for sure has it and it =
works
fine in any browser.<o:p></o:p></span></p>

<p class=3DMsoNormal><span lang=3DEN-US><o:p>&nbsp;</o:p></span></p>

<p class=3DMsoNormal><span lang=3DEN-US>Please, help. Maybe, I do =
something
wrong&#8230;<o:p></o:p></span></p>

<p class=3DMsoNormal><span lang=3DEN-US>Many thanks in =
advance.<o:p></o:p></span></p>

<p class=3DMsoNormal><span lang=3DEN-US><o:p>&nbsp;</o:p></span></p>

<p class=3DMsoNormal><span lang=3DEN-US>Here my xml file and the =
log:<o:p></o:p></span></p>

<p class=3DMsoNormal><span lang=3DEN-US><o:p>&nbsp;</o:p></span></p>

<p class=3DMsoNormal><span lang=3DEN-US>&lt;?xml =
version=3D&quot;1.0&quot;?&gt;<o:p></o:p></span></p>

<p class=3DMsoNormal><span lang=3DEN-US>&lt;!DOCTYPE project SYSTEM
&quot;../dtd/Project.dtd&quot;&gt;<o:p></o:p></span></p>

<p class=3DMsoNormal><span lang=3DEN-US>&lt;project =
default=3D&quot;test&quot;&gt;<o:p></o:p></span></p>

<p class=3DMsoNormal><span =
lang=3DEN-US>&nbsp;&nbsp;&nbsp;&nbsp;&nbsp;&nbsp;&nbsp;&nbsp;&nbsp;&nbsp;=
&nbsp;&nbsp;&nbsp;&nbsp;&nbsp;
&lt;target name=3D&quot;test&quot;&gt;<o:p></o:p></span></p>

<p class=3DMsoNormal><span =
lang=3DEN-US>&nbsp;&nbsp;&nbsp;&nbsp;&nbsp;&nbsp;&nbsp;&nbsp;&nbsp;&nbsp;=
&nbsp;&nbsp;&nbsp;&nbsp;&nbsp;&nbsp;&nbsp;&nbsp;&nbsp;&nbsp;&nbsp;&nbsp;&=
nbsp;&nbsp;&nbsp;&nbsp;&nbsp;&nbsp;&nbsp;&nbsp;
&lt;webtest name=3D&quot;check that eMayor Aachen is =
up&quot;&gt;<o:p></o:p></span></p>

<p class=3DMsoNormal><span =
lang=3DEN-US>&nbsp;&nbsp;&nbsp;&nbsp;&nbsp;&nbsp;&nbsp;&nbsp;&nbsp;&nbsp;=
&nbsp;&nbsp;&nbsp;&nbsp;&nbsp;&nbsp;&nbsp;&nbsp;&nbsp;&nbsp;&nbsp;&nbsp;&=
nbsp;&nbsp;&nbsp;&nbsp;&nbsp;&nbsp;&nbsp;&nbsp;&nbsp;&nbsp;&nbsp;&nbsp;&n=
bsp;&nbsp;&nbsp;&nbsp;&nbsp;&nbsp;&nbsp;&nbsp;&nbsp;&nbsp;&nbsp;&nbsp;
&lt;steps&gt;<o:p></o:p></span></p>

<p class=3DMsoNormal><span =
lang=3DEN-US>&nbsp;&nbsp;&nbsp;&nbsp;&nbsp;&nbsp;&nbsp;&nbsp;&nbsp;&nbsp;=
&nbsp;&nbsp;&nbsp;&nbsp;&nbsp;&nbsp;&nbsp;&nbsp;&nbsp;&nbsp;&nbsp;&nbsp;&=
nbsp;&nbsp;&nbsp;&nbsp;&nbsp;&nbsp;&nbsp;&nbsp;&nbsp;&nbsp;&nbsp;&nbsp;&n=
bsp;&nbsp;&nbsp;&nbsp;&nbsp;&nbsp;&nbsp;&nbsp;&nbsp;&nbsp;&nbsp;&nbsp;&nb=
sp;&nbsp;&nbsp;&nbsp;&nbsp;&nbsp;&nbsp;&nbsp;&nbsp;&nbsp;&nbsp;&nbsp;&nbs=
p;&nbsp;&nbsp;&nbsp;
&lt;invoke
url=3D&quot;http://192.168.222.131:8080/eMayor2.0/login.do?municipalityNa=
meKey=3DName.Aachen&quot;
description=3D&quot;Go to eMayor Aachen&quot;/&gt;<o:p></o:p></span></p>

<p class=3DMsoNormal><span =
lang=3DEN-US>&nbsp;&nbsp;&nbsp;&nbsp;&nbsp;&nbsp;&nbsp;&nbsp;&nbsp;&nbsp;=
&nbsp;&nbsp;&nbsp;&nbsp;&nbsp;&nbsp;&nbsp;&nbsp;&nbsp;&nbsp;&nbsp;&nbsp;&=
nbsp;&nbsp;&nbsp;&nbsp;&nbsp;&nbsp;&nbsp;&nbsp;&nbsp;&nbsp;&nbsp;&nbsp;&n=
bsp;&nbsp;&nbsp;&nbsp;&nbsp;&nbsp;&nbsp;&nbsp;&nbsp;&nbsp;&nbsp;&nbsp;&nb=
sp;&nbsp;&nbsp;&nbsp;&nbsp;&nbsp;&nbsp;&nbsp;&nbsp;&nbsp;&nbsp;&nbsp;&nbs=
p;&nbsp;&nbsp;&nbsp;
&lt;verifyTitle text=3D&quot;eMayor Login&quot; =
/&gt;<o:p></o:p></span></p>

<p class=3DMsoNormal><span =
lang=3DEN-US>&nbsp;&nbsp;&nbsp;&nbsp;&nbsp;&nbsp;&nbsp;&nbsp;&nbsp;&nbsp;=
&nbsp;&nbsp;&nbsp;&nbsp;&nbsp;&nbsp;&nbsp;&nbsp;&nbsp;&nbsp;&nbsp;&nbsp;&=
nbsp;&nbsp;&nbsp;&nbsp;&nbsp;&nbsp;&nbsp;&nbsp;&nbsp;&nbsp;&nbsp;&nbsp;&n=
bsp;&nbsp;&nbsp;&nbsp;&nbsp;&nbsp;&nbsp;&nbsp;&nbsp;&nbsp;&nbsp;&nbsp;&nb=
sp;&nbsp;&nbsp;&nbsp;&nbsp;&nbsp;&nbsp;&nbsp;&nbsp;&nbsp;&nbsp;&nbsp;&nbs=
p;&nbsp;&nbsp;&nbsp;
&lt;appletRunner <o:p></o:p></span></p>

<p class=3DMsoNormal><span =
lang=3DEN-US>&nbsp;&nbsp;&nbsp;&nbsp;&nbsp;&nbsp;&nbsp;&nbsp;&nbsp;&nbsp;=
&nbsp;&nbsp;&nbsp;&nbsp;&nbsp;&nbsp;&nbsp;&nbsp;&nbsp;&nbsp;&nbsp;&nbsp;&=
nbsp;&nbsp;&nbsp;&nbsp;&nbsp;&nbsp;&nbsp;&nbsp;&nbsp;&nbsp;&nbsp;&nbsp;&n=
bsp;&nbsp;&nbsp;&nbsp;&nbsp;&nbsp;&nbsp;&nbsp;&nbsp;&nbsp;&nbsp;&nbsp;&nb=
sp;&nbsp;&nbsp;&nbsp;&nbsp;&nbsp;&nbsp;&nbsp;&nbsp;&nbsp;&nbsp;&nbsp;&nbs=
p;&nbsp;&nbsp;&nbsp;&nbsp;&nbsp;&nbsp;&nbsp;&nbsp;&nbsp;&nbsp;&nbsp;&nbsp=
;&nbsp;&nbsp;&nbsp;&nbsp;&nbsp;&nbsp;&nbsp;&nbsp;&nbsp;&nbsp;&nbsp;&nbsp;=
&nbsp;&nbsp;&nbsp;&nbsp;&nbsp;&nbsp;&nbsp;&nbsp;&nbsp;&nbsp;
scenario=3D&quot;LoginButtonApplet&quot; <o:p></o:p></span></p>

<p class=3DMsoNormal><span =
lang=3DEN-US>&nbsp;&nbsp;&nbsp;&nbsp;&nbsp;&nbsp;&nbsp;&nbsp;&nbsp;&nbsp;=
&nbsp;&nbsp;&nbsp;&nbsp;&nbsp;&nbsp;&nbsp;&nbsp;&nbsp;&nbsp;&nbsp;&nbsp;&=
nbsp;&nbsp;&nbsp;&nbsp;&nbsp;&nbsp;&nbsp;&nbsp;&nbsp;&nbsp;&nbsp;&nbsp;&n=
bsp;&nbsp;&nbsp;&nbsp;&nbsp;&nbsp;&nbsp;&nbsp;&nbsp;&nbsp;&nbsp;&nbsp;&nb=
sp;&nbsp;&nbsp;&nbsp;&nbsp;&nbsp;&nbsp;&nbsp;&nbsp;&nbsp;&nbsp;&nbsp;&nbs=
p;&nbsp;&nbsp;&nbsp;&nbsp;&nbsp;&nbsp;&nbsp;&nbsp;&nbsp;&nbsp;&nbsp;&nbsp=
;&nbsp;&nbsp;&nbsp;&nbsp;&nbsp;&nbsp;
&nbsp;&nbsp;&nbsp;&nbsp;&nbsp;&nbsp;&nbsp;&nbsp;&nbsp;&nbsp;&nbsp;&nbsp;&=
nbsp;&nbsp;&nbsp;
xpath=3D&quot;/html/body/table/tbody/tr/td/table/tbody/tr/td/table/tbody/=
tr/td/p/applet&quot;&gt;<o:p></o:p></span></p>

<p class=3DMsoNormal><span =
lang=3DEN-US>&nbsp;&nbsp;&nbsp;&nbsp;&nbsp;&nbsp;&nbsp;&nbsp;&nbsp;&nbsp;=
&nbsp;&nbsp;&nbsp;&nbsp;&nbsp;&nbsp;&nbsp;&nbsp;&nbsp;&nbsp;&nbsp;&nbsp;&=
nbsp;&nbsp;&nbsp;&nbsp;&nbsp;&nbsp;&nbsp;&nbsp;&nbsp;&nbsp;&nbsp;&nbsp;&n=
bsp;&nbsp;&nbsp;&nbsp;&nbsp;&nbsp;&nbsp;&nbsp;&nbsp;&nbsp;&nbsp;&nbsp;&nb=
sp;&nbsp;&nbsp;&nbsp;&nbsp;&nbsp;&nbsp;&nbsp;&nbsp;&nbsp;&nbsp;&nbsp;&nbs=
p;&nbsp;&nbsp;&nbsp;
&lt;/appletRunner&gt;<o:p></o:p></span></p>

<p class=3DMsoNormal><span =
lang=3DEN-US>&nbsp;&nbsp;&nbsp;&nbsp;&nbsp;&nbsp;&nbsp;&nbsp;&nbsp;&nbsp;=
&nbsp;&nbsp;&nbsp;&nbsp;&nbsp;&nbsp;&nbsp;&nbsp;&nbsp;&nbsp;&nbsp;&nbsp;&=
nbsp;&nbsp;&nbsp;&nbsp;&nbsp;&nbsp;&nbsp;&nbsp;&nbsp;&nbsp;&nbsp;&nbsp;&n=
bsp;&nbsp;&nbsp;&nbsp;&nbsp;&nbsp;&nbsp;&nbsp;&nbsp;&nbsp;&nbsp;&nbsp;
&lt;/steps&gt;<o:p></o:p></span></p>

<p class=3DMsoNormal><span =
lang=3DEN-US>&nbsp;&nbsp;&nbsp;&nbsp;&nbsp;&nbsp;&nbsp;&nbsp;&nbsp;&nbsp;=
&nbsp;&nbsp;&nbsp;&nbsp;&nbsp;&nbsp;&nbsp;&nbsp;&nbsp;&nbsp;&nbsp;&nbsp;&=
nbsp;&nbsp;&nbsp;&nbsp;&nbsp;&nbsp;&nbsp;&nbsp;
&lt;/webtest&gt;<o:p></o:p></span></p>

<p class=3DMsoNormal><span =
lang=3DEN-US>&nbsp;&nbsp;&nbsp;&nbsp;&nbsp;&nbsp;&nbsp;&nbsp;&nbsp;&nbsp;=
&nbsp;&nbsp;&nbsp;&nbsp;&nbsp;
&lt;/target&gt;<o:p></o:p></span></p>

<p class=3DMsoNormal><span =
lang=3DEN-US>&lt;/project&gt;<o:p></o:p></span></p>

<p class=3DMsoNormal><span lang=3DEN-US><o:p>&nbsp;</o:p></span></p>

<p class=3DMsoNormal><span lang=3DEN-US><o:p>&nbsp;</o:p></span></p>

<p class=3DMsoNormal><span lang=3DEN-US>The<span =
style=3D'color:#1F497D'> error from
the</span> log info:<o:p></o:p></span></p>

<p class=3DMsoNormal><span lang=3DEN-US><o:p>&nbsp;</o:p></span></p>

<p class=3DMsoNormal><span lang=3DEN-US>=9A[appletRunner]
'com.canoo.webtest.extension.applet.runner.AppletRunner'&nbsp;&nbsp;&nbsp=
;&nbsp;&nbsp;&nbsp;&nbsp;&nbsp;&nbsp;&nbsp;&nbsp;&nbsp;&nbsp;&nbsp;&nbsp;=
&nbsp;&nbsp;&nbsp;&nbsp;&nbsp;&nbsp;&nbsp;&nbsp;&nbsp;&nbsp;&nbsp;&nbsp;&=
nbsp;&nbsp;&nbsp;&nbsp;&nbsp;&nbsp;&nbsp;&nbsp;&nbsp;&nbsp;&nbsp;&nbsp;&n=
bsp;&nbsp;&nbsp;&nbsp;&nbsp;&nbsp;&nbsp;&nbsp;&nbsp;
<o:p></o:p></span></p>

<p class=3DMsoNormal>[appletRunner]
'C:\DOKUME~1\ygl\LOKALE~1\Temp\AppletPlugin32537.arguments'&nbsp;&nbsp;&n=
bsp;&nbsp;&nbsp;&nbsp;&nbsp;&nbsp;&nbsp;&nbsp;&nbsp;&nbsp;&nbsp;&nbsp;&nb=
sp;&nbsp;&nbsp;&nbsp;&nbsp;&nbsp;&nbsp;&nbsp;&nbsp;&nbsp;&nbsp;&nbsp;&nbs=
p;&nbsp;&nbsp;&nbsp;&nbsp;&nbsp;&nbsp;&nbsp;&nbsp;&nbsp;&nbsp;&nbsp;&nbsp=
;&nbsp;&nbsp;&nbsp;&nbsp;&nbsp;&nbsp;
<o:p></o:p></p>

<p class=3DMsoNormal><span =
lang=3DEN-US>[appletRunner]&nbsp;&nbsp;&nbsp;&nbsp;&nbsp;&nbsp;&nbsp;&nbs=
p;&nbsp;&nbsp;&nbsp;&nbsp;&nbsp;&nbsp;&nbsp;&nbsp;&nbsp;&nbsp;&nbsp;&nbsp=
;&nbsp;&nbsp;&nbsp;&nbsp;&nbsp;&nbsp;&nbsp;&nbsp;&nbsp;&nbsp;&nbsp;&nbsp;=
&nbsp;
&nbsp;&nbsp;&nbsp;&nbsp;&nbsp;&nbsp;&nbsp;&nbsp;&nbsp;&nbsp;&nbsp;&nbsp;&=
nbsp;&nbsp;&nbsp;&nbsp;&nbsp;&nbsp;&nbsp;&nbsp;&nbsp;&nbsp;&nbsp;&nbsp;&n=
bsp;&nbsp;&nbsp;&nbsp;&nbsp;&nbsp;&nbsp;&nbsp;&nbsp;&nbsp;&nbsp;&nbsp;&nb=
sp;&nbsp;&nbsp;&nbsp;&nbsp;&nbsp;&nbsp;&nbsp;&nbsp;&nbsp;&nbsp;&nbsp;&nbs=
p;&nbsp;&nbsp;&nbsp;&nbsp;&nbsp;&nbsp;&nbsp;&nbsp;&nbsp;&nbsp;&nbsp;&nbsp=
;&nbsp;&nbsp;&nbsp;&nbsp;&nbsp;&nbsp;&nbsp;&nbsp;&nbsp;&nbsp;&nbsp;<o:p><=
/o:p></span></p>

<p class=3DMsoNormal><span lang=3DEN-US>[appletRunner] The ' characters =
around the
executable and arguments
are&nbsp;&nbsp;&nbsp;&nbsp;&nbsp;&nbsp;&nbsp;&nbsp;&nbsp;&nbsp;&nbsp;&nbs=
p;&nbsp;&nbsp;&nbsp;&nbsp;&nbsp;&nbsp;&nbsp;&nbsp;&nbsp;&nbsp;&nbsp;&nbsp=
;&nbsp;&nbsp;&nbsp;&nbsp;&nbsp;&nbsp;&nbsp;&nbsp;&nbsp;&nbsp;&nbsp;&nbsp;=
&nbsp;&nbsp;&nbsp;&nbsp;&nbsp;&nbsp;&nbsp;&nbsp;&nbsp;&nbsp;&nbsp;&nbsp;
<o:p></o:p></span></p>

<p class=3DMsoNormal><span lang=3DEN-US>[appletRunner] not part of the
command.&nbsp;&nbsp;&nbsp;&nbsp;&nbsp;&nbsp;&nbsp;&nbsp;&nbsp;&nbsp;&nbsp=
;&nbsp;&nbsp;&nbsp;&nbsp;&nbsp;&nbsp;&nbsp;&nbsp;&nbsp;&nbsp;&nbsp;
&nbsp;&nbsp;&nbsp;&nbsp;&nbsp;&nbsp;&nbsp;&nbsp;&nbsp;&nbsp;&nbsp;&nbsp;&=
nbsp;&nbsp;&nbsp;&nbsp;&nbsp;&nbsp;&nbsp;&nbsp;&nbsp;&nbsp;&nbsp;&nbsp;&n=
bsp;&nbsp;&nbsp;&nbsp;&nbsp;&nbsp;&nbsp;&nbsp;&nbsp;&nbsp;&nbsp;&nbsp;&nb=
sp;&nbsp;&nbsp;&nbsp;&nbsp;&nbsp;&nbsp;&nbsp;&nbsp;&nbsp;&nbsp;&nbsp;&nbs=
p;&nbsp;&nbsp;&nbsp;&nbsp;&nbsp;&nbsp;&nbsp;&nbsp;&nbsp;<o:p></o:p></span=
></p>

<p class=3DMsoNormal><span =
lang=3DEN-US>[appletRunner]&nbsp;&nbsp;&nbsp;&nbsp;&nbsp;&nbsp;&nbsp;&nbs=
p;&nbsp;&nbsp;&nbsp;&nbsp;&nbsp;&nbsp;&nbsp;&nbsp;&nbsp;&nbsp;&nbsp;&nbsp=
;&nbsp;&nbsp;&nbsp;&nbsp;&nbsp;&nbsp;&nbsp;&nbsp;&nbsp;&nbsp;&nbsp;&nbsp;=
&nbsp;&nbsp;&nbsp;&nbsp;&nbsp;&nbsp;&nbsp;&nbsp;&nbsp;&nbsp;&nbsp;&nbsp;&=
nbsp;&nbsp;&nbsp;&nbsp;&nbsp;&nbsp;&nbsp;&nbsp;&nbsp;&nbsp;&nbsp;&nbsp;&n=
bsp;&nbsp;&nbsp;&nbsp;&nbsp;&nbsp;&nbsp;&nbsp;&nbsp;&nbsp;&nbsp;&nbsp;&nb=
sp;&nbsp;&nbsp;&nbsp;&nbsp;&nbsp;&nbsp;&nbsp;&nbsp;&nbsp;&nbsp;&nbsp;&nbs=
p;&nbsp;&nbsp;&nbsp;&nbsp;&nbsp;&nbsp;&nbsp;&nbsp;&nbsp;&nbsp;&nbsp;&nbsp=
;&nbsp;&nbsp;&nbsp;&nbsp;&nbsp;&nbsp;&nbsp;&nbsp;&nbsp;&nbsp;&nbsp;&nbsp;=

<o:p></o:p></span></p>

<p class=3DMsoNormal><span lang=3DEN-US>[appletRunner] Using
org.netbeans.jemmy.drivers.DefaultDriverInstaller driver
installer&nbsp;&nbsp;&nbsp;&nbsp;&nbsp;&nbsp;&nbsp;&nbsp;&nbsp;&nbsp;&nbs=
p;&nbsp;&nbsp;&nbsp;&nbsp;&nbsp;&nbsp;&nbsp;&nbsp;&nbsp;&nbsp;&nbsp;&nbsp=
;&nbsp;&nbsp;&nbsp;&nbsp;&nbsp;&nbsp;&nbsp;&nbsp;&nbsp;
<o:p></o:p></span></p>

<p class=3DMsoNormal><span lang=3DEN-US>[appletRunner]&nbsp; INFO
(com.canoo.webtest.extension.applet.runner.http.HttpURLConnection) -
getInputStream(http://192.168.<o:p></o:p></span></p>

<p class=3DMsoNormal><span =
lang=3DEN-US>222.131:8080/eMayor2.0/LoginButtonApplet.class)&nbsp;&nbsp;&=
nbsp;&nbsp;&nbsp;&nbsp;&nbsp;&nbsp;&nbsp;&nbsp;&nbsp;&nbsp;&nbsp;&nbsp;&n=
bsp;&nbsp;&nbsp;&nbsp;&nbsp;&nbsp;&nbsp;&nbsp;&nbsp;&nbsp;&nbsp;&nbsp;&nb=
sp;&nbsp;&nbsp;&nbsp;&nbsp;&nbsp;&nbsp;&nbsp;&nbsp;&nbsp;&nbsp;&nbsp;&nbs=
p;&nbsp;&nbsp;&nbsp;&nbsp;&nbsp;&nbsp;&nbsp;&nbsp;&nbsp;&nbsp;&nbsp;&nbsp=
;&nbsp;&nbsp;&nbsp;&nbsp;&nbsp;&nbsp;&nbsp;&nbsp;&nbsp;&nbsp;&nbsp;&nbsp;=
&nbsp;&nbsp;&nbsp;&nbsp;&nbsp;&nbsp;&nbsp;&nbsp;&nbsp;
<o:p></o:p></span></p>

<p class=3DMsoNormal><span lang=3DEN-US>[appletRunner]&nbsp; INFO
(com.canoo.webtest.extension.applet.runner.http.HttpURLConnection) -
connect(http://192.168.222.131<o:p></o:p></span></p>

<p class=3DMsoNormal><span =
lang=3DEN-US>:8080/eMayor2.0/LoginButtonApplet.class)&nbsp;&nbsp;&nbsp;&n=
bsp;&nbsp;&nbsp;&nbsp;&nbsp;&nbsp;&nbsp;&nbsp;&nbsp;&nbsp;&nbsp;&nbsp;&nb=
sp;&nbsp;&nbsp;&nbsp;&nbsp;&nbsp;&nbsp;&nbsp;&nbsp;&nbsp;&nbsp;&nbsp;&nbs=
p;&nbsp;&nbsp;&nbsp;&nbsp;&nbsp;&nbsp;&nbsp;&nbsp;&nbsp;&nbsp;&nbsp;&nbsp=
;&nbsp;&nbsp;&nbsp;&nbsp;&nbsp;&nbsp;&nbsp;&nbsp;&nbsp;&nbsp;&nbsp;&nbsp;=
&nbsp;&nbsp;&nbsp;&nbsp;&nbsp;&nbsp;&nbsp;&nbsp;&nbsp;&nbsp;&nbsp;&nbsp;&=
nbsp;&nbsp;&nbsp;&nbsp;&nbsp;&nbsp;&nbsp;&nbsp;&nbsp;&nbsp;&nbsp;&nbsp;&n=
bsp;&nbsp;&nbsp;
<o:p></o:p></span></p>

<p class=3DMsoNormal><span lang=3DEN-US>[appletRunner]&nbsp; INFO
(com.canoo.webtest.extension.applet.runner.http.HttpURLConnection) -
getInputStream(http://192.168.<o:p></o:p></span></p>

<p class=3DMsoNormal><span =
lang=3DEN-US>222.131:8080/eMayor2.0/LoginButtonApplet.class)&nbsp;&nbsp;&=
nbsp;&nbsp;&nbsp;&nbsp;&nbsp;&nbsp;&nbsp;&nbsp;&nbsp;&nbsp;&nbsp;&nbsp;&n=
bsp;&nbsp;&nbsp;&nbsp;&nbsp;&nbsp;&nbsp;&nbsp;&nbsp;&nbsp;&nbsp;&nbsp;&nb=
sp;&nbsp;&nbsp;&nbsp;&nbsp;&nbsp;&nbsp;&nbsp;&nbsp;&nbsp;&nbsp;&nbsp;&nbs=
p;&nbsp;&nbsp;&nbsp;&nbsp;&nbsp;&nbsp;&nbsp;&nbsp;&nbsp;&nbsp;&nbsp;&nbsp=
;&nbsp;&nbsp;&nbsp;&nbsp;&nbsp;&nbsp;&nbsp;&nbsp;&nbsp;&nbsp;&nbsp;&nbsp;=
&nbsp;&nbsp;&nbsp;&nbsp;&nbsp;&nbsp;&nbsp;&nbsp;&nbsp;
<o:p></o:p></span></p>

<p class=3DMsoNormal><span lang=3DEN-US>[appletRunner]&nbsp; INFO =
(com.canoo.webtest.extension.applet.runner.http.HttpURLConnection)
- getHeaderField(content-length)<o:p></o:p></span></p>

<p class=3DMsoNormal><span lang=3DEN-US>&nbsp;-&gt;
5550&nbsp;&nbsp;&nbsp;&nbsp;&nbsp;&nbsp;&nbsp;&nbsp;&nbsp;&nbsp;&nbsp;&nb=
sp;&nbsp;&nbsp;&nbsp;&nbsp;&nbsp;&nbsp;&nbsp;&nbsp;&nbsp;&nbsp;&nbsp;&nbs=
p;&nbsp;&nbsp;&nbsp;&nbsp;&nbsp;&nbsp;&nbsp;&nbsp;&nbsp;
&nbsp;&nbsp;&nbsp;&nbsp;&nbsp;&nbsp;&nbsp;&nbsp;&nbsp;&nbsp;&nbsp;&nbsp;&=
nbsp;&nbsp;&nbsp;&nbsp;&nbsp;&nbsp;&nbsp;&nbsp;&nbsp;&nbsp;&nbsp;&nbsp;&n=
bsp;&nbsp;&nbsp;&nbsp;&nbsp;&nbsp;&nbsp;&nbsp;&nbsp;&nbsp;&nbsp;&nbsp;&nb=
sp;&nbsp;&nbsp;&nbsp;&nbsp;&nbsp;&nbsp;&nbsp;&nbsp;&nbsp;&nbsp;&nbsp;&nbs=
p;&nbsp;&nbsp;&nbsp;&nbsp;&nbsp;&nbsp;&nbsp;&nbsp;&nbsp;&nbsp;&nbsp;&nbsp=
;&nbsp;&nbsp;&nbsp;&nbsp;&nbsp;&nbsp;&nbsp;&nbsp;&nbsp;&nbsp;&nbsp;&nbsp;=
&nbsp;&nbsp;&nbsp;&nbsp;&nbsp;<o:p></o:p></span></p>

<p class=3DMsoNormal><span lang=3DEN-US>[appletRunner] ERROR =
(com.canoo.webtest.extension.applet.runner.AppletRunner)
- LoginButtonApplet.&lt;init&gt;(com.canoo.webte<o:p></o:p></span></p>

<p class=3DMsoNormal><span =
lang=3DEN-US>st.extension.applet.runner.AppletRunner,
java.awt.Frame)&nbsp;&nbsp;&nbsp;&nbsp;&nbsp;&nbsp;&nbsp;&nbsp;&nbsp;&nbs=
p;&nbsp;&nbsp;&nbsp;&nbsp;&nbsp;&nbsp;&nbsp;&nbsp;&nbsp;&nbsp;&nbsp;&nbsp=
;&nbsp;&nbsp;&nbsp;&nbsp;&nbsp;&nbsp;&nbsp;&nbsp;&nbsp;&nbsp;&nbsp;&nbsp;=
&nbsp;&nbsp;&nbsp;&nbsp;&nbsp;&nbsp;&nbsp;&nbsp;&nbsp;&nbsp;&nbsp;&nbsp;&=
nbsp;&nbsp;&nbsp;&nbsp;&nbsp;&nbsp;&nbsp;&nbsp;&nbsp;&nbsp;&nbsp;&nbsp;&n=
bsp;&nbsp;&nbsp;&nbsp;&nbsp;
<o:p></o:p></span></p>

<p class=3DMsoNormal><span lang=3DEN-US>[appletRunner]
java.lang.NoSuchMethodException: =
LoginButtonApplet.&lt;init&gt;(com.canoo.webtest.extension.applet.runner.=
Apple<o:p></o:p></span></p>

<p class=3DMsoNormal><span lang=3DEN-US>tRunner,
java.awt.Frame)&nbsp;&nbsp;&nbsp;&nbsp;&nbsp;&nbsp;&nbsp;&nbsp;&nbsp;&nbs=
p;&nbsp;&nbsp;&nbsp;&nbsp;&nbsp;&nbsp;&nbsp;&nbsp;&nbsp;&nbsp;&nbsp;&nbsp=
;&nbsp;&nbsp;&nbsp;&nbsp;&nbsp;&nbsp;&nbsp;&nbsp;&nbsp;&nbsp;&nbsp;&nbsp;=
&nbsp;&nbsp;&nbsp;&nbsp;&nbsp;&nbsp;&nbsp;&nbsp;&nbsp;&nbsp;&nbsp;
&nbsp;&nbsp;&nbsp;&nbsp;&nbsp;&nbsp;&nbsp;&nbsp;&nbsp;&nbsp;&nbsp;&nbsp;&=
nbsp;&nbsp;&nbsp;&nbsp;&nbsp;&nbsp;&nbsp;&nbsp;&nbsp;&nbsp;&nbsp;&nbsp;&n=
bsp;&nbsp;&nbsp;&nbsp;&nbsp;&nbsp;&nbsp;&nbsp;&nbsp;&nbsp;&nbsp;&nbsp;&nb=
sp;&nbsp;&nbsp;&nbsp;&nbsp;&nbsp;&nbsp;&nbsp;&nbsp;&nbsp;&nbsp;&nbsp;&nbs=
p;&nbsp;<o:p></o:p></span></p>

<p class=3DMsoNormal><span lang=3DEN-US>[appletRunner]&nbsp; at
java.lang.Class.getConstructor0(Unknown Source)<o:p></o:p></span></p>

<p class=3DMsoNormal><span lang=3DEN-US>[appletRunner]&nbsp; at
java.lang.Class.getConstructor(Unknown
Source)&nbsp;&nbsp;&nbsp;&nbsp;&nbsp;&nbsp;&nbsp;&nbsp;&nbsp;&nbsp;&nbsp;=
&nbsp;&nbsp;&nbsp;&nbsp;&nbsp;&nbsp;&nbsp;&nbsp;
&nbsp;&nbsp;&nbsp;&nbsp;&nbsp;&nbsp;&nbsp;&nbsp;&nbsp;&nbsp;&nbsp;&nbsp;&=
nbsp;&nbsp;&nbsp;&nbsp;&nbsp;&nbsp;&nbsp;&nbsp;&nbsp;&nbsp;&nbsp;&nbsp;&n=
bsp;&nbsp;&nbsp;&nbsp;&nbsp;&nbsp;&nbsp;&nbsp;&nbsp;&nbsp;&nbsp;<o:p></o:=
p></span></p>

<p class=3DMsoNormal><span lang=3DEN-US>[appletRunner]&nbsp; at
com.canoo.webtest.extension.applet.runner.AppletRunner.createObject(Apple=
tRunner.java:146)&nbsp;&nbsp;&nbsp;&nbsp;&nbsp;&nbsp;&nbsp;&nbsp;&nbsp;&n=
bsp;
<o:p></o:p></span></p>

<p class=3DMsoNormal><span lang=3DEN-US>[appletRunner]&nbsp; at
com.canoo.webtest.extension.applet.runner.AppletRunner.newScenario(Applet=
Runner.java:129)&nbsp;&nbsp;&nbsp;&nbsp;&nbsp;&nbsp;&nbsp;&nbsp;&nbsp;&nb=
sp;&nbsp;
<o:p></o:p></span></p>

<p class=3DMsoNormal><span lang=3DEN-US>[appletRunner]&nbsp; at
com.canoo.webtest.extension.applet.runner.AppletRunner.run(AppletRunner.j=
ava:83)&nbsp;&nbsp;&nbsp;&nbsp;&nbsp;&nbsp;&nbsp;&nbsp;&nbsp;&nbsp;&nbsp;=
&nbsp;&nbsp;&nbsp;&nbsp;&nbsp;&nbsp;&nbsp;&nbsp;&nbsp;
<o:p></o:p></span></p>

<p class=3DMsoNormal><span lang=3DEN-US>[appletRunner]&nbsp; at =
com.canoo.webtest.extension.applet.runner.AppletRunner.main(AppletRunner.=
java:62)&nbsp;&nbsp;&nbsp;&nbsp;&nbsp;&nbsp;&nbsp;&nbsp;&nbsp;&nbsp;&nbsp=
;&nbsp;
&nbsp;&nbsp;&nbsp;&nbsp;&nbsp;&nbsp;&nbsp;<o:p></o:p></span></p>

<p class=3DMsoNormal><span lang=3DEN-US>[appletRunner]&nbsp; INFO
(com.canoo.webtest.extension.applet.AppletRunnerStep) - runApplet: =
exitValue
was:
-3&nbsp;&nbsp;&nbsp;&nbsp;&nbsp;&nbsp;&nbsp;&nbsp;&nbsp;&nbsp;&nbsp;&nbsp=
;&nbsp;&nbsp;
<o:p></o:p></span></p>

<p class=3DMsoNormal><span lang=3DEN-US>[appletRunner] ERROR =
(com.canoo.webtest.extension.applet.AppletRunnerStep)
- Test LoginButtonApplet failed. Exit value: <o:p></o:p></span></p>

<p class=3DMsoNormal><span lang=3DEN-US>-3&nbsp;&nbsp;&nbsp;
&nbsp;&nbsp;&nbsp;&nbsp;&nbsp;&nbsp;&nbsp;&nbsp;&nbsp;&nbsp;&nbsp;&nbsp;&=
nbsp;&nbsp;&nbsp;&nbsp;&nbsp;&nbsp;&nbsp;&nbsp;&nbsp;&nbsp;&nbsp;&nbsp;&n=
bsp;&nbsp;&nbsp;&nbsp;&nbsp;&nbsp;&nbsp;&nbsp;&nbsp;&nbsp;&nbsp;&nbsp;&nb=
sp;&nbsp;&nbsp;&nbsp;&nbsp;&nbsp;&nbsp;&nbsp;&nbsp;&nbsp;&nbsp;&nbsp;&nbs=
p;&nbsp;&nbsp;&nbsp;&nbsp;&nbsp;&nbsp;&nbsp;&nbsp;&nbsp;&nbsp;&nbsp;&nbsp=
;&nbsp;&nbsp;&nbsp;&nbsp;&nbsp;&nbsp;&nbsp;&nbsp;&nbsp;&nbsp;&nbsp;&nbsp;=
&nbsp;&nbsp;&nbsp;&nbsp;&nbsp;&nbsp;&nbsp;&nbsp;&nbsp;&nbsp;&nbsp;&nbsp;&=
nbsp;&nbsp;&nbsp;&nbsp;&nbsp;&nbsp;&nbsp;&nbsp;&nbsp;&nbsp;&nbsp;&nbsp;&n=
bsp;&nbsp;&nbsp;&nbsp;&nbsp;&nbsp;&nbsp;&nbsp;&nbsp;&nbsp;&nbsp;&nbsp;&nb=
sp;&nbsp;&nbsp;&nbsp;&nbsp;<o:p></o:p></span></p>

<p class=3DMsoNormal><span lang=3DEN-US>&nbsp;INFO
(com.canoo.webtest.engine.WebClientContext) - Responses
restored&nbsp;&nbsp;&nbsp;&nbsp;&nbsp;&nbsp;&nbsp;&nbsp;&nbsp;&nbsp;&nbsp=
;&nbsp;&nbsp;&nbsp;&nbsp;&nbsp;&nbsp;&nbsp;&nbsp;&nbsp;&nbsp;&nbsp;&nbsp;=
&nbsp;&nbsp;&nbsp;&nbsp;&nbsp;&nbsp;&nbsp;&nbsp;&nbsp;&nbsp;&nbsp;&nbsp;&=
nbsp;&nbsp;&nbsp;&nbsp;&nbsp;&nbsp;&nbsp;&nbsp;&nbsp;&nbsp;&nbsp;&nbsp;&n=
bsp;&nbsp;
<o:p></o:p></span></p>

<p class=3DMsoNormal><span lang=3DEN-US>&nbsp;INFO
(com.canoo.webtest.ant.WebtestTask) - Finished executing webtest =
&quot;check
that eMayor Aachen is up&quot; (C:\Work\Testing<o:p></o:p></span></p>

<p class=3DMsoNormal><span =
lang=3DEN-US>\Canoo\myWebTestProject\tests\yglWebTest.xml:9:
)&nbsp;&nbsp;&nbsp;&nbsp;&nbsp;&nbsp;&nbsp;&nbsp;&nbsp;&nbsp;&nbsp;&nbsp;=
&nbsp;&nbsp;&nbsp;&nbsp;&nbsp;&nbsp;&nbsp;&nbsp;&nbsp;&nbsp;&nbsp;&nbsp;&=
nbsp;&nbsp;&nbsp;&nbsp;&nbsp;&nbsp;&nbsp;&nbsp;&nbsp;&nbsp;&nbsp;&nbsp;&n=
bsp;&nbsp;&nbsp;&nbsp;&nbsp;&nbsp;&nbsp;&nbsp;&nbsp;&nbsp;&nbsp;&nbsp;&nb=
sp;&nbsp;&nbsp;&nbsp;&nbsp;&nbsp;&nbsp;&nbsp;&nbsp;&nbsp;&nbsp;&nbsp;&nbs=
p;&nbsp;&nbsp;&nbsp;&nbsp;&nbsp;&nbsp;&nbsp;&nbsp;&nbsp;
<o:p></o:p></span></p>

<p class=3DMsoNormal><span lang=3DEN-US>&nbsp;INFO
(com.canoo.webtest.reporting.XmlReporter) - Writing report to
C:\Work\Testing\Canoo\myWebTestProject\results\001_C<o:p></o:p></span></p=
>

<p class=3DMsoNormal><span =
lang=3DEN-US>heckThatEMayorA\WebTestReport.xml&nbsp;&nbsp;&nbsp;&nbsp;&nb=
sp;&nbsp;&nbsp;&nbsp;&nbsp;&nbsp;&nbsp;&nbsp;&nbsp;&nbsp;&nbsp;&nbsp;&nbs=
p;&nbsp;&nbsp;&nbsp;&nbsp;&nbsp;&nbsp;&nbsp;&nbsp;&nbsp;&nbsp;&nbsp;&nbsp=
;&nbsp;&nbsp;&nbsp;&nbsp;&nbsp;&nbsp;&nbsp;&nbsp;&nbsp;&nbsp;&nbsp;&nbsp;=
&nbsp;&nbsp;&nbsp;&nbsp;&nbsp;&nbsp;&nbsp;&nbsp;&nbsp;&nbsp;&nbsp;&nbsp;&=
nbsp;&nbsp;&nbsp;&nbsp;&nbsp;&nbsp;&nbsp;&nbsp;&nbsp;&nbsp;&nbsp;&nbsp;&n=
bsp;&nbsp;&nbsp;&nbsp;&nbsp;&nbsp;&nbsp;&nbsp;&nbsp;&nbsp;&nbsp;&nbsp;&nb=
sp;&nbsp;&nbsp;&nbsp;&nbsp;&nbsp;&nbsp;&nbsp;&nbsp;
<o:p></o:p></span></p>

<p class=3DMsoNormal><span lang=3DEN-US>&nbsp;INFO
(com.canoo.webtest.ant.WebtestTask) - Test report successfully
created.&nbsp;&nbsp;&nbsp;&nbsp;&nbsp;&nbsp;&nbsp;&nbsp;&nbsp;&nbsp;&nbsp=
;&nbsp;&nbsp;&nbsp;&nbsp;&nbsp;&nbsp;&nbsp;&nbsp;&nbsp;&nbsp;&nbsp;&nbsp;=
&nbsp;&nbsp;&nbsp;&nbsp;&nbsp;&nbsp;&nbsp;&nbsp;&nbsp;&nbsp;&nbsp;&nbsp;&=
nbsp;&nbsp;&nbsp;&nbsp;&nbsp;&nbsp;&nbsp;
<o:p></o:p></span></p>

<p class=3DMsoNormal><span =
lang=3DEN-US>&nbsp;&nbsp;&nbsp;&nbsp;&nbsp;&nbsp;&nbsp;&nbsp;&nbsp;&nbsp;=
&nbsp;&nbsp;&nbsp;&nbsp;&nbsp;&nbsp;&nbsp;&nbsp;&nbsp;&nbsp;&nbsp;&nbsp;&=
nbsp;&nbsp;&nbsp;&nbsp;&nbsp;&nbsp;&nbsp;&nbsp;&nbsp;&nbsp;&nbsp;&nbsp;&n=
bsp;&nbsp;&nbsp;&nbsp;&nbsp;&nbsp;&nbsp;&nbsp;&nbsp;&nbsp;&nbsp;&nbsp;&nb=
sp;&nbsp;&nbsp;&nbsp;&nbsp;&nbsp;&nbsp;&nbsp;&nbsp;&nbsp;&nbsp;&nbsp;&nbs=
p;&nbsp;&nbsp;&nbsp;&nbsp;&nbsp;&nbsp;&nbsp;&nbsp;&nbsp;&nbsp;&nbsp;&nbsp=
;&nbsp;&nbsp;&nbsp;&nbsp;&nbsp;&nbsp;&nbsp;&nbsp;&nbsp;&nbsp;&nbsp;&nbsp;=
&nbsp;&nbsp;&nbsp;&nbsp;&nbsp;&nbsp;&nbsp;&nbsp;&nbsp;&nbsp;&nbsp;&nbsp;&=
nbsp;&nbsp;&nbsp;&nbsp;&nbsp;&nbsp;&nbsp;&nbsp;&nbsp;&nbsp;&nbsp;&nbsp;&n=
bsp;&nbsp;&nbsp;&nbsp;&nbsp;&nbsp;&nbsp;&nbsp;&nbsp;&nbsp;&nbsp;&nbsp;
<o:p></o:p></span></p>

<p class=3DMsoNormal><span lang=3DEN-US>=9A<o:p></o:p></span></p>

<p class=3DMsoNormal><span lang=3DEN-US =
style=3D'color:#1F497D'>&#8230;</span><span
lang=3DEN-US><o:p></o:p></span></p>

<p class=3DMsoNormal><span =
lang=3DEN-US>&nbsp;&nbsp;&nbsp;&nbsp;&nbsp;&nbsp;&nbsp;&nbsp;&nbsp;&nbsp;=
&nbsp;&nbsp;&nbsp;&nbsp;&nbsp;&nbsp;&nbsp;&nbsp;&nbsp;&nbsp;&nbsp;&nbsp;&=
nbsp;&nbsp;&nbsp;&nbsp;&nbsp;&nbsp;&nbsp;&nbsp;&nbsp;&nbsp;&nbsp;&nbsp;&n=
bsp;&nbsp;&nbsp;&nbsp;&nbsp;&nbsp;&nbsp;&nbsp;&nbsp;&nbsp;&nbsp;&nbsp;&nb=
sp;&nbsp;&nbsp;&nbsp;&nbsp;&nbsp;&nbsp;&nbsp;&nbsp;&nbsp;&nbsp;&nbsp;&nbs=
p;&nbsp;&nbsp;&nbsp;&nbsp;&nbsp;&nbsp;&nbsp;&nbsp;&nbsp;&nbsp;&nbsp;&nbsp=
;&nbsp;&nbsp;&nbsp;&nbsp;&nbsp;&nbsp;&nbsp;&nbsp;&nbsp;&nbsp;&nbsp;&nbsp;=
&nbsp;&nbsp;&nbsp;&nbsp;&nbsp;&nbsp;&nbsp;&nbsp;&nbsp;&nbsp;&nbsp;&nbsp;&=
nbsp;&nbsp;&nbsp;&nbsp;&nbsp;&nbsp;&nbsp;&nbsp;&nbsp;&nbsp;&nbsp;&nbsp;&n=
bsp;&nbsp;&nbsp;&nbsp;&nbsp;&nbsp;&nbsp;&nbsp;&nbsp;&nbsp;&nbsp;&nbsp;
<o:p></o:p></span></p>

<p class=3DMsoNormal><span lang=3DEN-US>BUILD
FAILED&nbsp;&nbsp;&nbsp;&nbsp;&nbsp;&nbsp;&nbsp;&nbsp;&nbsp;&nbsp;&nbsp;&=
nbsp;&nbsp;&nbsp;&nbsp;
&nbsp;&nbsp;&nbsp;&nbsp;&nbsp;&nbsp;&nbsp;&nbsp;&nbsp;&nbsp;&nbsp;&nbsp;&=
nbsp;&nbsp;&nbsp;&nbsp;&nbsp;&nbsp;&nbsp;&nbsp;&nbsp;&nbsp;&nbsp;&nbsp;&n=
bsp;&nbsp;&nbsp;&nbsp;&nbsp;&nbsp;&nbsp;&nbsp;&nbsp;&nbsp;&nbsp;&nbsp;&nb=
sp;&nbsp;&nbsp;&nbsp;&nbsp;&nbsp;&nbsp;&nbsp;&nbsp;&nbsp;&nbsp;&nbsp;&nbs=
p;&nbsp;&nbsp;&nbsp;&nbsp;&nbsp;&nbsp;&nbsp;&nbsp;&nbsp;&nbsp;&nbsp;&nbsp=
;&nbsp;&nbsp;&nbsp;&nbsp;&nbsp;&nbsp;&nbsp;&nbsp;&nbsp;&nbsp;&nbsp;&nbsp;=
&nbsp;&nbsp;&nbsp;&nbsp;&nbsp;&nbsp;&nbsp;&nbsp;&nbsp;&nbsp;&nbsp;&nbsp;&=
nbsp;&nbsp;&nbsp;&nbsp;&nbsp;&nbsp;&nbsp;<o:p></o:p></span></p>

<p class=3DMsoNormal><span =
lang=3DEN-US>C:\Work\Testing\Canoo\build\webtest.xml:381:
1 of 1 webtests have failed (0
successful)!&nbsp;&nbsp;&nbsp;&nbsp;&nbsp;&nbsp;&nbsp;&nbsp;&nbsp;&nbsp;&=
nbsp;&nbsp;&nbsp;&nbsp;&nbsp;&nbsp;&nbsp;&nbsp;&nbsp;&nbsp;&nbsp;&nbsp;&n=
bsp;&nbsp;&nbsp;&nbsp;&nbsp;&nbsp;&nbsp;&nbsp;&nbsp;
<o:p></o:p></span></p>

<p class=3DMsoNormal><span =
lang=3DEN-US>&nbsp;&nbsp;&nbsp;&nbsp;&nbsp;&nbsp;&nbsp;&nbsp;&nbsp;&nbsp;=
&nbsp;&nbsp;&nbsp;&nbsp;&nbsp;&nbsp;&nbsp;&nbsp;&nbsp;&nbsp;&nbsp;&nbsp;&=
nbsp;&nbsp;&nbsp;&nbsp;&nbsp;&nbsp;&nbsp;&nbsp;&nbsp;&nbsp;&nbsp;&nbsp;&n=
bsp;&nbsp;&nbsp;&nbsp;&nbsp;&nbsp;&nbsp;
&nbsp;&nbsp;&nbsp;&nbsp;&nbsp;&nbsp;&nbsp;&nbsp;&nbsp;&nbsp;&nbsp;&nbsp;&=
nbsp;&nbsp;&nbsp;&nbsp;&nbsp;&nbsp;&nbsp;&nbsp;&nbsp;&nbsp;&nbsp;&nbsp;&n=
bsp;&nbsp;&nbsp;&nbsp;&nbsp;&nbsp;&nbsp;&nbsp;&nbsp;&nbsp;&nbsp;&nbsp;&nb=
sp;&nbsp;&nbsp;&nbsp;&nbsp;&nbsp;&nbsp;&nbsp;&nbsp;&nbsp;&nbsp;&nbsp;&nbs=
p;&nbsp;&nbsp;&nbsp;&nbsp;&nbsp;&nbsp;&nbsp;&nbsp;&nbsp;&nbsp;&nbsp;&nbsp=
;&nbsp;&nbsp;&nbsp;&nbsp;&nbsp;&nbsp;&nbsp;&nbsp;&nbsp;&nbsp;&nbsp;&nbsp;=
&nbsp;&nbsp;&nbsp;&nbsp;&nbsp;<o:p></o:p></span></p>

<p class=3DMsoNormal><span lang=3DEN-US>Total time: 11
seconds&nbsp;&nbsp;&nbsp;&nbsp;&nbsp;&nbsp;&nbsp;&nbsp;&nbsp;&nbsp;&nbsp;=
&nbsp;&nbsp;&nbsp;&nbsp;&nbsp;&nbsp;&nbsp;&nbsp;&nbsp;&nbsp;&nbsp;&nbsp;&=
nbsp;&nbsp;&nbsp;&nbsp;&nbsp;&nbsp;&nbsp;&nbsp;&nbsp;&nbsp;&nbsp;&nbsp;&n=
bsp;&nbsp;&nbsp;&nbsp;&nbsp;&nbsp;&nbsp;&nbsp;&nbsp;&nbsp;&nbsp;&nbsp;&nb=
sp;&nbsp;&nbsp;&nbsp;&nbsp;&nbsp;&nbsp;&nbsp;&nbsp;&nbsp;&nbsp;&nbsp;&nbs=
p;&nbsp;&nbsp;&nbsp;&nbsp;&nbsp;&nbsp;&nbsp;&nbsp;&nbsp;&nbsp;&nbsp;&nbsp=
;&nbsp;&nbsp;&nbsp;&nbsp;&nbsp;&nbsp;&nbsp;&nbsp;&nbsp;&nbsp;&nbsp;&nbsp;=
&nbsp;&nbsp;&nbsp;&nbsp;&nbsp;&nbsp;&nbsp;&nbsp;&nbsp;&nbsp;&nbsp;&nbsp;&=
nbsp;
&nbsp;&nbsp;&nbsp;&nbsp;&nbsp;&nbsp;&nbsp;&nbsp;&nbsp;&nbsp;&nbsp;&nbsp;&=
nbsp;&nbsp;&nbsp;&nbsp;&nbsp;&nbsp;&nbsp;&nbsp;&nbsp;&nbsp;&nbsp;&nbsp;&n=
bsp;&nbsp;&nbsp;&nbsp;&nbsp;&nbsp;&nbsp;&nbsp;&nbsp;&nbsp;&nbsp;&nbsp;&nb=
sp;&nbsp;&nbsp;&nbsp;&nbsp;&nbsp;&nbsp;&nbsp;&nbsp;&nbsp;&nbsp;&nbsp;&nbs=
p;&nbsp;&nbsp;&nbsp;&nbsp;&nbsp;&nbsp;&nbsp;&nbsp;&nbsp;&nbsp;&nbsp;&nbsp=
;&nbsp;&nbsp;&nbsp;&nbsp;&nbsp;&nbsp;&nbsp;&nbsp;&nbsp;&nbsp;&nbsp;&nbsp;=
&nbsp;&nbsp;&nbsp;&nbsp;&nbsp;&nbsp;&nbsp;&nbsp;&nbsp;&nbsp;&nbsp;&nbsp;&=
nbsp;&nbsp;&nbsp;&nbsp;&nbsp;&nbsp;&nbsp;&nbsp;&nbsp;&nbsp;&nbsp;&nbsp;&n=
bsp;&nbsp;&nbsp;&nbsp;&nbsp;&nbsp;&nbsp;&nbsp;&nbsp;&nbsp;&nbsp;&nbsp;&nb=
sp;&nbsp;&nbsp;&nbsp;&nbsp;&nbsp;&nbsp;&nbsp;&nbsp;&nbsp;&nbsp;&nbsp;&nbs=
p;<o:p></o:p></span></p>

</div>

</body>

</html>

------=_NextPart_000_0016_01C914F6.5DD68520--