[Webtest] RE: wt.htmlReports.xslt is not set when executing test from ant file

Merz, Daniel Merz, Daniel" <dme@zuehlke.com
Mon, 2 Jul 2012 13:18:57 +0000


--_000_5E0C17D7E91A054AA7D623AE476FF34B937BB6ZRHEX021adszuehlk_
Content-Type: text/plain; charset="iso-8859-1"
Content-Transfer-Encoding: quoted-printable

Here the detailed logs of what happens (when using debug option).
It seems that the value (wt.htmlRepors.xlst) is set correctly once but then=
 not forwarded to html report creator. Any ideas?


wt.htmlReports.init:
....
Setting project property: wt.htmlReports.report.title -> WebTest Test Repor=
t
Setting project property: wt.htmlReports.outputdir -> /work/ WebTests/Sampl=
eTest/results
Setting project property: wt.htmlReports.xslt -> /work/canoo_webtest/resour=
ces/WebTestReport.xsl
Setting project property: wt.htmlReports.xslt.summary -> /work/canoo_webtes=
t/resources/WebTestReportSummaryExtractor.xsl
Setting project property: wt.htmlReports.xslt.overview -> /work/canoo_webte=
st/resources/WebTestReportOverview.xsl
    [mkdir] Created dir: /work/ WebTests/SampleTest/results/resources
+User datatype: fileScanner     org.codehaus.groovy.ant.FileScanner
fileset: Setup scanner in dir /work/canoo_webtest/resources with patternSet=
{ includes: [*.css, *.js, *.html, images/*.*] excludes: [] }
....
Property "wt.htmlReports.xslt" has not been set
Property "wt.htmlReports.report.time" has not been set
Property "wt.htmlReports.report.title" has not been set
...

wt.htmlReports:
.....
[groovyScript] Script: com.canoo.webtest.reporting.HTMLReportGenerator.shut=
down()
     [xslt] Using class org.apache.tools.ant.taskdefs.optional.TraXLiaison
     [xslt] In file /work/ebox_HS_Software/Product/WebTests/SampleTest/resu=
lts/001_Test1a/WebTestReport.xml time: 1341234538000
     [xslt] Out file /work/ebox_HS_Software/Product/WebTests/SampleTest/res=
ults/001_Test1a/WebTestReport.html time: 0
     [xslt] Style file ${wt.htmlReports.xslt} time: 0
     [xslt] Processing /work/WebTests/SampleTest/results/001_Test1a/WebTest=
Report.xml to /work/WebTests/SampleTest/results/001_Test1a/WebTestReport.ht=
ml
     [xslt] Loading stylesheet /work/WebTests/SampleTest/tests/${wt.htmlRep=
orts.xslt}
     [xslt] Failed to process /work/WebTests/SampleTest/results/001_Test1a/=
WebTestReport.xml
+User datatype: fileScanner     org.codehaus.groovy.ant.FileScanner
[groovyScript] ERROR (com.canoo.webtest.reporting.HTMLReportGenerator) - Er=
ror formatting /work/ WebTests/SampleTest/results/001_Test1a/WebTestReport.=
xml done
[groovyScript] : The following error occurred while executing this line:
[groovyScript] /work/canoo_webtest/webtest.xml:279: java.io.FileNotFoundExc=
eption: /work/WebTests/SampleTest/tests/${wt.htmlReports.xslt} (No such fil=
e or directory)
[groovyScript]   at org.apache.tools.ant.ProjectHelper.addLocationToBuildEx=
ception(ProjectHelper.java:541)
[groovyScript]   at org.apache.tools.ant.taskdefs.MacroInstance.execute(Mac=
roInstance.java:394)
[groovyScript]   at sun.reflect.NativeMethodAccessorImpl.invoke0(Native Met=
hod)
[groovyScript]   at sun.reflect.NativeMethodAccessorImpl.invoke(NativeMetho=
dAccessorImpl.java:57)
[groovyScript]   at sun.reflect.DelegatingMethodAccessorImpl.invoke(Delegat=
ingMethodAccessorImpl.java:43)
[groovyScript]   at java.lang.reflect.Method.invoke(Method.java:616)
[groovyScript]   at org.apache.tools.ant.dispatch.DispatchUtils.execute(Dis=
patchUtils.java:105)
[groovyScript]   at org.apache.tools.ant.Task.perform(Task.java:348)
[groovyScript]   at groovy.util.AntBuilder.nodeCompleted(AntBuilder.java:21=
4)
[groovyScript]   at groovy.util.BuilderSupport.doInvokeMethod(BuilderSuppor=
t.java:147)
[groovyScript]   at groovy.util.AntBuilder.doInvokeMethod(AntBuilder.java:1=
60)
[groovyScript]   at groovy.util.BuilderSupport.invokeMethod(BuilderSupport.=
java:64)
[groovyScript]   at org.codehaus.groovy.runtime.callsite.PogoMetaClassSite.=
call(PogoMetaClassSite.java:45)
[groovyScript]   at org.codehaus.groovy.runtime.callsite.CallSiteArray.defa=
ultCall(CallSiteArray.java:40)
[groovyScript]   at org.codehaus.groovy.runtime.callsite.AbstractCallSite.c=
all(AbstractCallSite.java:117)
[groovyScript]   at org.codehaus.groovy.runtime.callsite.AbstractCallSite.c=
all(AbstractCallSite.java:125)
[groovyScript]   at com.canoo.webtest.reporting.HTMLReportGenerator.format(=
HTMLReportGenerator.groovy:61)
[groovyScript]   at com.canoo.webtest.reporting.HTMLReportGenerator.this$2$=
format(HTMLReportGenerator.groovy)
[groovyScript]   at com.canoo.webtest.reporting.HTMLReportGenerator$this$2$=
format.call(Unknown Source)
[groovyScript]   at org.codehaus.groovy.runtime.callsite.CallSiteArray.defa=
ultCall(CallSiteArray.java:40)
[groovyScript]   at org.codehaus.groovy.runtime.callsite.AbstractCallSite.c=
all(AbstractCallSite.java:117)
[groovyScript]   at org.codehaus.groovy.runtime.callsite.AbstractCallSite.c=
all(AbstractCallSite.java:129)
[groovyScript]   at com.canoo.webtest.reporting.FormatTask.call(HTMLReportG=
enerator.groovy:81)
[groovyScript]   at java.util.concurrent.FutureTask$Sync.innerRun(FutureTas=
k.java:334)
[groovyScript]   at java.util.concurrent.FutureTask.run(FutureTask.java:166=
)
[groovyScript]   at java.util.concurrent.ThreadPoolExecutor.runWorker(Threa=
dPoolExecutor.java:1110)
[groovyScript]   at java.util.concurrent.ThreadPoolExecutor$Worker.run(Thre=
adPoolExecutor.java:603)
[groovyScript]   at java.lang.Thread.run(Thread.java:636)
....

From: webtest-admin@lists.canoo.com [mailto:webtest-admin@lists.canoo.com] =
On Behalf Of Habbert, Michael (Key-Work)
Sent: Montag, 2. Juli 2012 13:01
To: webtest@lists.canoo.com
Subject: [Webtest] AW: wt.htmlReports.xslt is not set when executing test f=
rom ant file

Hi Daniel,

try to run the webtests with debug option for ant (-d) so you can verify th=
e correct value for: wt.htmlReports.xslt

With regards

Michael Habbert



Michael Habbert
Key-Work Consulting GmbH | Kriegsstr. 100 | 76133 Karlsruhe | Germany | www=
.key-work.de<http://www.key-work.de>
Fon: +49-721-78203-269 | E-Mail: michael.habbert@key-work.de<mailto:michael=
.habbert@key-work.de> | Fax: +49-721-78203-10

Key-Work Consulting GmbH, Karlsruhe, HRB 108695, HRG Mannheim
Gesch=E4ftsf=FChrer: Andreas Stappert, Tobin Wotring
Von: webtest-admin@lists.canoo.com<mailto:webtest-admin@lists.canoo.com> [m=
ailto:webtest-admin@lists.canoo.com]<mailto:[mailto:webtest-admin@lists.can=
oo.com]> Im Auftrag von Merz, Daniel
Gesendet: Freitag, 29. Juni 2012 10:31
An: webtest@lists.canoo.com<mailto:webtest@lists.canoo.com>
Betreff: [Webtest] wt.htmlReports.xslt is not set when executing test from =
ant file

Hi all

During organizing my tests into subfolders I struggled over following error=
. The output shows that the test is executed, and the report (WebTestReport=
.xml) is created, but during generating the overview page a file not found =
exception is thrown (java.io.FileNotFoundException: /work/SampleTest/tests/=
${wt.htmlReports.xslt} (No such file or directory)). It seems that the vari=
able wt.htmlReports.xslt  is not set. When the same webtest "Test1a" is exe=
cuted in build.xml everythings works fine.

I hope you have an idea how to fix it.  Below all the 3 files and the conso=
le output

Best regards
Daniel


>>>>> build.xml >>>>>>>>>

<?xml version=3D"1.0"?>
<project name=3D"MyTests" basedir=3D"." default=3D"wt.full">
  <property name=3D"wt.groovyTests.skip" value=3D"skip" />
  <property name=3D"webtest.home" location=3D"/work/canoo_webtest" />
  <import file=3D"${webtest.home}/webtest.xml"/>

  <target name=3D"wt.testInWork">
        <ant dir=3D"tests" antfile=3D"allTests.xml"/>
  </target>
</project>

<<<<< build.xml <<<<<<<<<

>>>>> tests/allTests.xml >>>>>>>>>

<?xml version=3D"1.0"?>
<project name=3D"all" default=3D"all">
  <target name=3D"all">
       <ant antfile=3D"test1/test1.xml"/>
  </target>
</project>

<<<<< tests/allTests.xml <<<<<<<<<

>>>>> tests/test1/test1.xml >>>>>>>>>

<?xml version=3D"1.0"?>
<project name=3D"test1" default=3D"test1">
    <target name=3D"test1">
        <webtest name=3D"Test1a">
          <invoke url=3D"http://www.google.com" description=3D"google home"=
 />
          <verifyText description=3D"google somewhere" text=3D"google" />
        </webtest>
    </target>
</project>

<<<<< tests/test1/test1.xml <<<<<<<<<



>>>>> Output >>>>>>>>>
....
  [webtest]  INFO (com.canoo.webtest.ant.WebtestTask) - Starting webtest "T=
est1a" (/work/SampleTest/tests/test1/test1.xml:4: )
  [webtest]  INFO (com.canoo.webtest.ant.WebtestTask) - Canoo Webtest: R_18=
13.
...
   [invoke]  INFO (com.canoo.webtest.steps.Step) - >>>> Start Step: invoke =
"google home" (1/2)
....
[verifyText]  INFO (com.canoo.webtest.steps.Step) - >>>> Start Step: verify=
Text "google somewhere" (2/2)
INFO (com.canoo.webtest.ant.WebtestTask) - Finished executing webtest "Test=
1a" (/work/SampleTest/tests/test1/test1.xml:4: )
INFO (com.canoo.webtest.reporting.XmlReporter) - Writing report to /work/Sa=
mpleTest/results/001_Test1a/WebTestReport.xml
INFO (com.canoo.webtest.ant.WebtestTask) - Test report successfully created=
.

wt.groovyTests:

wt.parallel.waitForCompletion:

wt.htmlReports.init:
    [mkdir] Created dir: /work/SampleTest/results/resources
     [echo] Formatting /work/SampleTest/results/001_Test1a/WebTestReport.xm=
l to HTML in folder /work/SampleTest/results/001_Test1a
     [copy] Copying 22 files to /work/SampleTest/results/resources
     [xslt] Processing /work/SampleTest/results/001_Test1a/WebTestReport.xm=
l to /work/SampleTest/results/001_Test1a/WebTestReport.html
     [xslt] Loading stylesheet /work/SampleTest/tests/${wt.htmlReports.xslt=
}
     [xslt] Failed to process /work/SampleTest/results/001_Test1a/WebTestRe=
port.xml
     [copy] Copying 1 file to /work/SampleTest/results

wt.htmlReports:
     [echo] Waiting for completion of background generation of single repor=
ts
[groovyScript] ERROR (com.canoo.webtest.reporting.HTMLReportGenerator) - Er=
ror formatting /work/SampleTest/results/001_Test1a/WebTestReport.xml done
[groovyScript] : The following error occurred while executing this line:
[groovyScript] /work/canoo_webtest/webtest.xml:279: java.io.FileNotFoundExc=
eption: /work/SampleTest/tests/${wt.htmlReports.xslt} (No such file or dire=
ctory)
[groovyScript]   at org.apache.tools.ant.ProjectHelper.addLocationToBuildEx=
ception(ProjectHelper.java:541)
[groovyScript]   at org.apache.tools.ant.taskdefs.MacroInstance.execute(Mac=
roInstance.java:394)
[groovyScript]   at sun.reflect.NativeMethodAccessorImpl.invoke0(Native Met=
hod)
....
[groovyScript] Caused by: /work/canoo_webtest/webtest.xml:279: java.io.File=
NotFoundException: /work/SampleTest/tests/${wt.htmlReports.xslt} (No such f=
ile or directory)
[groovyScript]   at org.apache.tools.ant.taskdefs.XSLTProcess.process(XSLTP=
rocess.java:720)
[groovyScript]   at org.apache.tools.ant.taskdefs.XSLTProcess.execute(XSLTP=
rocess.java:333)
[groovyScript]   at org.apache.tools.ant.UnknownElement.execute(UnknownElem=
ent.java:288)
....
     [echo] Generating WebTestOverview
[groovyScript]  WARN (com.gargoylesoftware.htmlunit.IncorrectnessListenerIm=
pl) - Obsolete content type encountered: 'text/javascript'.

wt.openResultFile.init:

wt.openResultFile:
     [echo] Opening result file /work/SampleTest/results/index.html with fi=
refox

wt.junitLikeReports:

BUILD FAILED
/work/canoo_webtest/webtest.xml:444: input file /work/SampleTest/results/We=
bTestOverview.xml does not exist

<<<<< Output <<<<<<<<<

Ant version: 1.7.0
Java version: 1.6.0_18
Webtest: 3.0

--_000_5E0C17D7E91A054AA7D623AE476FF34B937BB6ZRHEX021adszuehlk_
Content-Type: text/html; charset="iso-8859-1"
Content-Transfer-Encoding: quoted-printable

<html xmlns:v=3D"urn:schemas-microsoft-com:vml" xmlns:o=3D"urn:schemas-micr=
osoft-com:office:office" xmlns:w=3D"urn:schemas-microsoft-com:office:word" =
xmlns:m=3D"http://schemas.microsoft.com/office/2004/12/omml" xmlns=3D"http:=
//www.w3.org/TR/REC-html40">
<head>
<meta http-equiv=3D"Content-Type" content=3D"text/html; charset=3Diso-8859-=
1">
<meta name=3D"Generator" content=3D"Microsoft Word 14 (filtered medium)">
<style><!--
/* Font Definitions */
@font-face
	{font-family:Calibri;
	panose-1:2 15 5 2 2 2 4 3 2 4;}
@font-face
	{font-family:Tahoma;
	panose-1:2 11 6 4 3 5 4 4 2 4;}
/* Style Definitions */
p.MsoNormal, li.MsoNormal, div.MsoNormal
	{margin:0cm;
	margin-bottom:.0001pt;
	font-size:11.0pt;
	font-family:"Calibri","sans-serif";
	mso-fareast-language:EN-US;}
a:link, span.MsoHyperlink
	{mso-style-priority:99;
	color:blue;
	text-decoration:underline;}
a:visited, span.MsoHyperlinkFollowed
	{mso-style-priority:99;
	color:purple;
	text-decoration:underline;}
p.MsoAcetate, li.MsoAcetate, div.MsoAcetate
	{mso-style-priority:99;
	mso-style-link:"Balloon Text Char";
	margin:0cm;
	margin-bottom:.0001pt;
	font-size:8.0pt;
	font-family:"Tahoma","sans-serif";
	mso-fareast-language:EN-US;}
span.EmailStyle17
	{mso-style-type:personal;
	font-family:"Calibri","sans-serif";
	color:windowtext;}
span.EmailStyle18
	{mso-style-type:personal;
	font-family:"Calibri","sans-serif";
	color:#1F497D;}
span.BalloonTextChar
	{mso-style-name:"Balloon Text Char";
	mso-style-priority:99;
	mso-style-link:"Balloon Text";
	font-family:"Tahoma","sans-serif";
	mso-fareast-language:EN-US;}
span.EmailStyle22
	{mso-style-type:personal-reply;
	font-family:"Calibri","sans-serif";
	color:#1F497D;}
.MsoChpDefault
	{mso-style-type:export-only;
	font-size:10.0pt;}
@page WordSection1
	{size:612.0pt 792.0pt;
	margin:70.85pt 70.85pt 2.0cm 70.85pt;}
div.WordSection1
	{page:WordSection1;}
--></style><!--[if gte mso 9]><xml>
<o:shapedefaults v:ext=3D"edit" spidmax=3D"1026" />
</xml><![endif]--><!--[if gte mso 9]><xml>
<o:shapelayout v:ext=3D"edit">
<o:idmap v:ext=3D"edit" data=3D"1" />
</o:shapelayout></xml><![endif]-->
</head>
<body lang=3D"DE-CH" link=3D"blue" vlink=3D"purple">
<div class=3D"WordSection1">
<p class=3D"MsoNormal"><span lang=3D"EN-US">Here the detailed logs of what =
happens (when using debug option).
<o:p></o:p></span></p>
<p class=3D"MsoNormal"><span lang=3D"EN-US">It seems that the value (wt.htm=
lRepors.xlst) is set correctly once but then not forwarded to html report c=
reator. Any ideas?<o:p></o:p></span></p>
<p class=3D"MsoNormal"><span lang=3D"EN-US"><o:p>&nbsp;</o:p></span></p>
<p class=3D"MsoNormal"><span lang=3D"EN-US"><o:p>&nbsp;</o:p></span></p>
<p class=3D"MsoNormal"><span lang=3D"EN-US">wt.htmlReports.init:<o:p></o:p>=
</span></p>
<p class=3D"MsoNormal"><span lang=3D"EN-US">&#8230;.<o:p></o:p></span></p>
<p class=3D"MsoNormal"><span lang=3D"EN-US">Setting project property: wt.ht=
mlReports.report.title -&gt; WebTest Test Report<o:p></o:p></span></p>
<p class=3D"MsoNormal"><span lang=3D"EN-US">Setting project property: wt.ht=
mlReports.outputdir -&gt; /work/ WebTests/SampleTest/results<o:p></o:p></sp=
an></p>
<p class=3D"MsoNormal"><span lang=3D"EN-US">Setting project property: wt.ht=
mlReports.xslt -&gt; /work/canoo_webtest/resources/WebTestReport.xsl<o:p></=
o:p></span></p>
<p class=3D"MsoNormal"><span lang=3D"EN-US">Setting project property: wt.ht=
mlReports.xslt.summary -&gt; /work/canoo_webtest/resources/WebTestReportSum=
maryExtractor.xsl<o:p></o:p></span></p>
<p class=3D"MsoNormal"><span lang=3D"EN-US">Setting project property: wt.ht=
mlReports.xslt.overview -&gt; /work/canoo_webtest/resources/WebTestReportOv=
erview.xsl<o:p></o:p></span></p>
<p class=3D"MsoNormal"><span lang=3D"EN-US">&nbsp;&nbsp;&nbsp; [mkdir] Crea=
ted dir: /work/ WebTests/SampleTest/results/resources<o:p></o:p></span></p>
<p class=3D"MsoNormal"><span lang=3D"EN-US">&#43;User datatype: fileScanner=
&nbsp;&nbsp;&nbsp;&nbsp; org.codehaus.groovy.ant.FileScanner<o:p></o:p></sp=
an></p>
<p class=3D"MsoNormal"><span lang=3D"EN-US">fileset: Setup scanner in dir /=
work/canoo_webtest/resources with patternSet{ includes: [*.css, *.js, *.htm=
l, images/*.*] excludes: [] }<o:p></o:p></span></p>
<p class=3D"MsoNormal"><span lang=3D"EN-US">&#8230;.<o:p></o:p></span></p>
<p class=3D"MsoNormal"><span lang=3D"EN-US">Property &quot;wt.htmlReports.x=
slt&quot; has not been set<o:p></o:p></span></p>
<p class=3D"MsoNormal"><span lang=3D"EN-US">Property &quot;wt.htmlReports.r=
eport.time&quot; has not been set<o:p></o:p></span></p>
<p class=3D"MsoNormal"><span lang=3D"EN-US">Property &quot;wt.htmlReports.r=
eport.title&quot; has not been set<o:p></o:p></span></p>
<p class=3D"MsoNormal"><span lang=3D"EN-US">&#8230;<o:p></o:p></span></p>
<p class=3D"MsoNormal"><span lang=3D"EN-US"><o:p>&nbsp;</o:p></span></p>
<p class=3D"MsoNormal"><span lang=3D"EN-US">wt.htmlReports:<o:p></o:p></spa=
n></p>
<p class=3D"MsoNormal"><span lang=3D"EN-US">&#8230;..<o:p></o:p></span></p>
<p class=3D"MsoNormal"><span lang=3D"EN-US">[groovyScript] Script: com.cano=
o.webtest.reporting.HTMLReportGenerator.shutdown()<o:p></o:p></span></p>
<p class=3D"MsoNormal"><span lang=3D"EN-US">&nbsp;&nbsp;&nbsp;&nbsp; [xslt]=
 Using class org.apache.tools.ant.taskdefs.optional.TraXLiaison<o:p></o:p><=
/span></p>
<p class=3D"MsoNormal"><span lang=3D"EN-US">&nbsp;&nbsp;&nbsp;&nbsp; [xslt]=
 In file /work/ebox_HS_Software/Product/WebTests/SampleTest/results/001_Tes=
t1a/WebTestReport.xml time: 1341234538000<o:p></o:p></span></p>
<p class=3D"MsoNormal"><span lang=3D"EN-US">&nbsp;&nbsp;&nbsp;&nbsp; [xslt]=
 Out file /work/ebox_HS_Software/Product/WebTests/SampleTest/results/001_Te=
st1a/WebTestReport.html time: 0<o:p></o:p></span></p>
<p class=3D"MsoNormal"><span lang=3D"EN-US">&nbsp;&nbsp;&nbsp;&nbsp; [xslt]=
 Style file ${wt.htmlReports.xslt} time: 0<o:p></o:p></span></p>
<p class=3D"MsoNormal"><span lang=3D"EN-US">&nbsp;&nbsp;&nbsp;&nbsp; [xslt]=
 Processing /work/WebTests/SampleTest/results/001_Test1a/WebTestReport.xml =
to /work/WebTests/SampleTest/results/001_Test1a/WebTestReport.html<o:p></o:=
p></span></p>
<p class=3D"MsoNormal"><span lang=3D"EN-US">&nbsp;&nbsp;&nbsp;&nbsp; [xslt]=
 Loading stylesheet /work/WebTests/SampleTest/tests/${wt.htmlReports.xslt}<=
o:p></o:p></span></p>
<p class=3D"MsoNormal"><span lang=3D"EN-US">&nbsp;&nbsp;&nbsp;&nbsp; [xslt]=
 Failed to process /work/WebTests/SampleTest/results/001_Test1a/WebTestRepo=
rt.xml<o:p></o:p></span></p>
<p class=3D"MsoNormal"><span lang=3D"EN-US">&#43;User datatype: fileScanner=
&nbsp;&nbsp;&nbsp;&nbsp; org.codehaus.groovy.ant.FileScanner<o:p></o:p></sp=
an></p>
<p class=3D"MsoNormal"><span lang=3D"EN-US">[groovyScript] ERROR (com.canoo=
.webtest.reporting.HTMLReportGenerator) - Error formatting /work/ WebTests/=
SampleTest/results/001_Test1a/WebTestReport.xml done<o:p></o:p></span></p>
<p class=3D"MsoNormal"><span lang=3D"EN-US">[groovyScript] : The following =
error occurred while executing this line:<o:p></o:p></span></p>
<p class=3D"MsoNormal"><span lang=3D"EN-US">[groovyScript] /work/canoo_webt=
est/webtest.xml:279: java.io.FileNotFoundException: /work/WebTests/SampleTe=
st/tests/${wt.htmlReports.xslt} (No such file or directory)<o:p></o:p></spa=
n></p>
<p class=3D"MsoNormal"><span lang=3D"EN-US">[groovyScript] &nbsp; at org.ap=
ache.tools.ant.ProjectHelper.addLocationToBuildException(ProjectHelper.java=
:541)<o:p></o:p></span></p>
<p class=3D"MsoNormal"><span lang=3D"EN-US">[groovyScript] &nbsp; at org.ap=
ache.tools.ant.taskdefs.MacroInstance.execute(MacroInstance.java:394)<o:p><=
/o:p></span></p>
<p class=3D"MsoNormal"><span lang=3D"EN-US">[groovyScript] &nbsp; at sun.re=
flect.NativeMethodAccessorImpl.invoke0(Native Method)<o:p></o:p></span></p>
<p class=3D"MsoNormal"><span lang=3D"EN-US">[groovyScript] &nbsp; at sun.re=
flect.NativeMethodAccessorImpl.invoke(NativeMethodAccessorImpl.java:57)<o:p=
></o:p></span></p>
<p class=3D"MsoNormal"><span lang=3D"EN-US">[groovyScript] &nbsp; at sun.re=
flect.DelegatingMethodAccessorImpl.invoke(DelegatingMethodAccessorImpl.java=
:43)<o:p></o:p></span></p>
<p class=3D"MsoNormal"><span lang=3D"EN-US">[groovyScript] &nbsp; at java.l=
ang.reflect.Method.invoke(Method.java:616)<o:p></o:p></span></p>
<p class=3D"MsoNormal"><span lang=3D"EN-US">[groovyScript] &nbsp; at org.ap=
ache.tools.ant.dispatch.DispatchUtils.execute(DispatchUtils.java:105)<o:p><=
/o:p></span></p>
<p class=3D"MsoNormal"><span lang=3D"EN-US">[groovyScript] &nbsp; at org.ap=
ache.tools.ant.Task.perform(Task.java:348)<o:p></o:p></span></p>
<p class=3D"MsoNormal"><span lang=3D"EN-US">[groovyScript] &nbsp; at groovy=
.util.AntBuilder.nodeCompleted(AntBuilder.java:214)<o:p></o:p></span></p>
<p class=3D"MsoNormal"><span lang=3D"EN-US">[groovyScript] &nbsp; at groovy=
.util.BuilderSupport.doInvokeMethod(BuilderSupport.java:147)<o:p></o:p></sp=
an></p>
<p class=3D"MsoNormal"><span lang=3D"EN-US">[groovyScript] &nbsp; at groovy=
.util.AntBuilder.doInvokeMethod(AntBuilder.java:160)<o:p></o:p></span></p>
<p class=3D"MsoNormal"><span lang=3D"EN-US">[groovyScript] &nbsp; at groovy=
.util.BuilderSupport.invokeMethod(BuilderSupport.java:64)<o:p></o:p></span>=
</p>
<p class=3D"MsoNormal"><span lang=3D"EN-US">[groovyScript] &nbsp; at org.co=
dehaus.groovy.runtime.callsite.PogoMetaClassSite.call(PogoMetaClassSite.jav=
a:45)<o:p></o:p></span></p>
<p class=3D"MsoNormal"><span lang=3D"EN-US">[groovyScript] &nbsp; at org.co=
dehaus.groovy.runtime.callsite.CallSiteArray.defaultCall(CallSiteArray.java=
:40)<o:p></o:p></span></p>
<p class=3D"MsoNormal"><span lang=3D"EN-US">[groovyScript] &nbsp; at org.co=
dehaus.groovy.runtime.callsite.AbstractCallSite.call(AbstractCallSite.java:=
117)<o:p></o:p></span></p>
<p class=3D"MsoNormal"><span lang=3D"EN-US">[groovyScript] &nbsp; at org.co=
dehaus.groovy.runtime.callsite.AbstractCallSite.call(AbstractCallSite.java:=
125)<o:p></o:p></span></p>
<p class=3D"MsoNormal"><span lang=3D"EN-US">[groovyScript] &nbsp; at com.ca=
noo.webtest.reporting.HTMLReportGenerator.format(HTMLReportGenerator.groovy=
:61)<o:p></o:p></span></p>
<p class=3D"MsoNormal"><span lang=3D"EN-US">[groovyScript] &nbsp; at com.ca=
noo.webtest.reporting.HTMLReportGenerator.this$2$format(HTMLReportGenerator=
.groovy)<o:p></o:p></span></p>
<p class=3D"MsoNormal"><span lang=3D"EN-US">[groovyScript] &nbsp; at com.ca=
noo.webtest.reporting.HTMLReportGenerator$this$2$format.call(Unknown Source=
)<o:p></o:p></span></p>
<p class=3D"MsoNormal"><span lang=3D"EN-US">[groovyScript] &nbsp; at org.co=
dehaus.groovy.runtime.callsite.CallSiteArray.defaultCall(CallSiteArray.java=
:40)<o:p></o:p></span></p>
<p class=3D"MsoNormal"><span lang=3D"EN-US">[groovyScript] &nbsp; at org.co=
dehaus.groovy.runtime.callsite.AbstractCallSite.call(AbstractCallSite.java:=
117)<o:p></o:p></span></p>
<p class=3D"MsoNormal"><span lang=3D"EN-US">[groovyScript] &nbsp; at org.co=
dehaus.groovy.runtime.callsite.AbstractCallSite.call(AbstractCallSite.java:=
129)<o:p></o:p></span></p>
<p class=3D"MsoNormal"><span lang=3D"EN-US">[groovyScript] &nbsp; at com.ca=
noo.webtest.reporting.FormatTask.call(HTMLReportGenerator.groovy:81)<o:p></=
o:p></span></p>
<p class=3D"MsoNormal"><span lang=3D"EN-US">[groovyScript] &nbsp; at java.u=
til.concurrent.FutureTask$Sync.innerRun(FutureTask.java:334)<o:p></o:p></sp=
an></p>
<p class=3D"MsoNormal"><span lang=3D"EN-US">[groovyScript] &nbsp; at java.u=
til.concurrent.FutureTask.run(FutureTask.java:166)<o:p></o:p></span></p>
<p class=3D"MsoNormal"><span lang=3D"EN-US">[groovyScript] &nbsp; at java.u=
til.concurrent.ThreadPoolExecutor.runWorker(ThreadPoolExecutor.java:1110)<o=
:p></o:p></span></p>
<p class=3D"MsoNormal"><span lang=3D"EN-US">[groovyScript] &nbsp; at java.u=
til.concurrent.ThreadPoolExecutor$Worker.run(ThreadPoolExecutor.java:603)<o=
:p></o:p></span></p>
<p class=3D"MsoNormal"><span lang=3D"EN-US">[groovyScript] &nbsp; at java.l=
ang.Thread.run(Thread.java:636)<o:p></o:p></span></p>
<p class=3D"MsoNormal"><span lang=3D"EN-US">&#8230;.<o:p></o:p></span></p>
<p class=3D"MsoNormal"><span lang=3D"EN-US"><o:p>&nbsp;</o:p></span></p>
<div>
<div style=3D"border:none;border-top:solid #B5C4DF 1.0pt;padding:3.0pt 0cm =
0cm 0cm">
<p class=3D"MsoNormal"><b><span lang=3D"EN-US" style=3D"font-size:10.0pt;fo=
nt-family:&quot;Tahoma&quot;,&quot;sans-serif&quot;;mso-fareast-language:DE=
-CH">From:</span></b><span lang=3D"EN-US" style=3D"font-size:10.0pt;font-fa=
mily:&quot;Tahoma&quot;,&quot;sans-serif&quot;;mso-fareast-language:DE-CH">=
 webtest-admin@lists.canoo.com
 [mailto:webtest-admin@lists.canoo.com] <b>On Behalf Of </b>Habbert, Michae=
l (Key-Work)<br>
<b>Sent:</b> Montag, 2. Juli 2012 13:01<br>
<b>To:</b> webtest@lists.canoo.com<br>
<b>Subject:</b> [Webtest] AW: wt.htmlReports.xslt is not set when executing=
 test from ant file<o:p></o:p></span></p>
</div>
</div>
<p class=3D"MsoNormal"><o:p>&nbsp;</o:p></p>
<p class=3D"MsoNormal"><span lang=3D"DE" style=3D"color:#1F497D">Hi Daniel,=
<o:p></o:p></span></p>
<p class=3D"MsoNormal"><span lang=3D"DE" style=3D"color:#1F497D"><o:p>&nbsp=
;</o:p></span></p>
<p class=3D"MsoNormal"><span lang=3D"DE" style=3D"color:#1F497D">try to run=
 the webtests with debug option for ant (-d) so you can verify the correct =
value for:
</span><span lang=3D"EN-US">wt.htmlReports.xslt<o:p></o:p></span></p>
<p class=3D"MsoNormal"><span lang=3D"EN-US"><o:p>&nbsp;</o:p></span></p>
<p class=3D"MsoNormal"><span lang=3D"EN-US">With regards<o:p></o:p></span><=
/p>
<p class=3D"MsoNormal"><span lang=3D"EN-US"><o:p>&nbsp;</o:p></span></p>
<p class=3D"MsoNormal"><span lang=3D"EN-US">Michael Habbert<o:p></o:p></spa=
n></p>
<p class=3D"MsoNormal"><span lang=3D"DE"><o:p>&nbsp;</o:p></span></p>
<div>
<div>
<p class=3D"MsoNormal"><span lang=3D"DE" style=3D"color:navy">&nbsp;<br>
&nbsp;<br>
<strong><span style=3D"font-family:&quot;Calibri&quot;,&quot;sans-serif&quo=
t;">Michael Habbert</span></strong>
<br>
Key-Work Consulting GmbH | Kriegsstr. 100 | 76133 Karlsruhe | Germany | <a =
href=3D"http://www.key-work.de" target=3D"_blank" title=3D"Key-Work Consult=
ing GmbH">
www.key-work.de</a><br>
Fon: &#43;49-721-78203-269 | E-Mail: <a href=3D"mailto:michael.habbert@key-=
work.de">michael.habbert@key-work.de</a> | Fax: &#43;49-721-78203-10
<br>
&nbsp;<br>
Key-Work Consulting GmbH, Karlsruhe, HRB 108695, HRG Mannheim<br>
Gesch=E4ftsf=FChrer: Andreas Stappert, Tobin Wotring </span><span lang=3D"D=
E"><o:p></o:p></span></p>
</div>
<div style=3D"border:none;border-top:solid #B5C4DF 1.0pt;padding:3.0pt 0cm =
0cm 0cm">
<p class=3D"MsoNormal"><b><span lang=3D"DE" style=3D"font-size:10.0pt;font-=
family:&quot;Tahoma&quot;,&quot;sans-serif&quot;;mso-fareast-language:DE">V=
on:</span></b><span lang=3D"DE" style=3D"font-size:10.0pt;font-family:&quot=
;Tahoma&quot;,&quot;sans-serif&quot;;mso-fareast-language:DE">
<a href=3D"mailto:webtest-admin@lists.canoo.com">webtest-admin@lists.canoo.=
com</a> <a href=3D"mailto:[mailto:webtest-admin@lists.canoo.com]">
[mailto:webtest-admin@lists.canoo.com]</a> <b>Im Auftrag von </b>Merz, Dani=
el<br>
<b>Gesendet:</b> Freitag, 29. Juni 2012 10:31<br>
<b>An:</b> <a href=3D"mailto:webtest@lists.canoo.com">webtest@lists.canoo.c=
om</a><br>
<b>Betreff:</b> [Webtest] wt.htmlReports.xslt is not set when executing tes=
t from ant file<o:p></o:p></span></p>
</div>
</div>
<p class=3D"MsoNormal"><span lang=3D"DE"><o:p>&nbsp;</o:p></span></p>
<p class=3D"MsoNormal"><span lang=3D"EN-US">Hi all<o:p></o:p></span></p>
<p class=3D"MsoNormal"><span lang=3D"EN-US"><o:p>&nbsp;</o:p></span></p>
<p class=3D"MsoNormal"><span lang=3D"EN-US">During organizing my tests into=
 subfolders I struggled over following error. The output shows that the tes=
t is executed, and the report (WebTestReport.xml) is created, but during ge=
nerating the overview page a file not
 found exception is thrown (java.io.FileNotFoundException: /work/SampleTest=
/tests/${wt.htmlReports.xslt} (No such file or directory)). It seems that t=
he variable wt.htmlReports.xslt &nbsp;is not set. When the same webtest &qu=
ot;Test1a&quot; is executed in build.xml everythings
 works fine. <o:p></o:p></span></p>
<p class=3D"MsoNormal"><span lang=3D"EN-US"><o:p>&nbsp;</o:p></span></p>
<p class=3D"MsoNormal"><span lang=3D"EN-US">I hope you have an idea how to =
fix it. &nbsp;Below all the 3 files and the console output<o:p></o:p></span=
></p>
<p class=3D"MsoNormal"><span lang=3D"EN-US"><o:p>&nbsp;</o:p></span></p>
<p class=3D"MsoNormal"><span lang=3D"EN-US">Best regards<o:p></o:p></span><=
/p>
<p class=3D"MsoNormal"><span lang=3D"EN-US">Daniel<o:p></o:p></span></p>
<p class=3D"MsoNormal"><span lang=3D"EN-US"><o:p>&nbsp;</o:p></span></p>
<p class=3D"MsoNormal"><span lang=3D"EN-US"><o:p>&nbsp;</o:p></span></p>
<p class=3D"MsoNormal"><span lang=3D"EN-US">&gt;&gt;&gt;&gt;&gt; build.xml =
&gt;&gt;&gt;&gt;&gt;&gt;&gt;&gt;&gt;<o:p></o:p></span></p>
<p class=3D"MsoNormal"><span lang=3D"EN-US"><o:p>&nbsp;</o:p></span></p>
<p class=3D"MsoNormal"><span lang=3D"EN-US">&lt;?xml version=3D&quot;1.0&qu=
ot;?&gt; <o:p></o:p></span></p>
<p class=3D"MsoNormal"><span lang=3D"EN-US">&lt;project name=3D&quot;MyTest=
s&quot; basedir=3D&quot;.&quot; default=3D&quot;wt.full&quot;&gt;<o:p></o:p=
></span></p>
<p class=3D"MsoNormal"><span lang=3D"EN-US">&nbsp; &lt;property name=3D&quo=
t;wt.groovyTests.skip&quot; value=3D&quot;skip&quot; /&gt;
<o:p></o:p></span></p>
<p class=3D"MsoNormal"><span lang=3D"EN-US">&nbsp;&nbsp;&lt;property name=
=3D&quot;webtest.home&quot; location=3D&quot;/work/canoo_webtest&quot; /&gt=
;<o:p></o:p></span></p>
<p class=3D"MsoNormal"><span lang=3D"EN-US">&nbsp; &lt;import file=3D&quot;=
${webtest.home}/webtest.xml&quot;/&gt;<o:p></o:p></span></p>
<p class=3D"MsoNormal"><span lang=3D"EN-US">&nbsp; <o:p></o:p></span></p>
<p class=3D"MsoNormal"><span lang=3D"EN-US">&nbsp;&nbsp;&lt;target name=3D&=
quot;wt.testInWork&quot;&gt;<o:p></o:p></span></p>
<p class=3D"MsoNormal"><span lang=3D"EN-US">&nbsp;&nbsp;&nbsp;&nbsp;&nbsp;&=
nbsp;&nbsp; &lt;ant dir=3D&quot;tests&quot; antfile=3D&quot;allTests.xml&qu=
ot;/&gt;<o:p></o:p></span></p>
<p class=3D"MsoNormal"><span lang=3D"EN-US">&nbsp; &lt;/target&gt;<o:p></o:=
p></span></p>
<p class=3D"MsoNormal"><span lang=3D"EN-US">&lt;/project&gt;<o:p></o:p></sp=
an></p>
<p class=3D"MsoNormal"><span lang=3D"EN-US"><o:p>&nbsp;</o:p></span></p>
<p class=3D"MsoNormal"><span lang=3D"EN-US">&lt;&lt;&lt;&lt;&lt; build.xml =
&lt;&lt;&lt;&lt;&lt;&lt;&lt;&lt;&lt;<o:p></o:p></span></p>
<p class=3D"MsoNormal"><span lang=3D"EN-US"><o:p>&nbsp;</o:p></span></p>
<p class=3D"MsoNormal"><span lang=3D"EN-US">&gt;&gt;&gt;&gt;&gt; tests/allT=
ests.xml &gt;&gt;&gt;&gt;&gt;&gt;&gt;&gt;&gt;<o:p></o:p></span></p>
<p class=3D"MsoNormal"><span lang=3D"EN-US"><o:p>&nbsp;</o:p></span></p>
<p class=3D"MsoNormal"><span lang=3D"EN-US">&lt;?xml version=3D&quot;1.0&qu=
ot;?&gt; <o:p></o:p></span></p>
<p class=3D"MsoNormal"><span lang=3D"EN-US">&lt;project name=3D&quot;all&qu=
ot; default=3D&quot;all&quot;&gt;<o:p></o:p></span></p>
<p class=3D"MsoNormal"><span lang=3D"EN-US">&nbsp; &lt;target name=3D&quot;=
all&quot;&gt;<o:p></o:p></span></p>
<p class=3D"MsoNormal"><span lang=3D"EN-US">&nbsp;&nbsp;&nbsp;&nbsp;&nbsp;&=
nbsp; &lt;ant antfile=3D&quot;test1/test1.xml&quot;/&gt;<o:p></o:p></span><=
/p>
<p class=3D"MsoNormal"><span lang=3D"EN-US">&nbsp; &lt;/target&gt;&nbsp;&nb=
sp;&nbsp;&nbsp;&nbsp;&nbsp;&nbsp; <o:p></o:p></span></p>
<p class=3D"MsoNormal"><span lang=3D"EN-US">&lt;/project&gt;<o:p></o:p></sp=
an></p>
<p class=3D"MsoNormal"><span lang=3D"EN-US"><o:p>&nbsp;</o:p></span></p>
<p class=3D"MsoNormal"><span lang=3D"EN-US">&lt;&lt;&lt;&lt;&lt; tests/allT=
ests.xml &lt;&lt;&lt;&lt;&lt;&lt;&lt;&lt;&lt;<o:p></o:p></span></p>
<p class=3D"MsoNormal"><span lang=3D"EN-US"><o:p>&nbsp;</o:p></span></p>
<p class=3D"MsoNormal"><span lang=3D"EN-US">&gt;&gt;&gt;&gt;&gt; tests/test=
1/test1.xml &gt;&gt;&gt;&gt;&gt;&gt;&gt;&gt;&gt;<o:p></o:p></span></p>
<p class=3D"MsoNormal"><span lang=3D"EN-US"><o:p>&nbsp;</o:p></span></p>
<p class=3D"MsoNormal"><span lang=3D"EN-US">&lt;?xml version=3D&quot;1.0&qu=
ot;?&gt;<o:p></o:p></span></p>
<p class=3D"MsoNormal"><span lang=3D"EN-US">&lt;project name=3D&quot;test1&=
quot; default=3D&quot;test1&quot;&gt;<o:p></o:p></span></p>
<p class=3D"MsoNormal"><span lang=3D"EN-US">&nbsp;&nbsp;&nbsp; &lt;target n=
ame=3D&quot;test1&quot;&gt;<o:p></o:p></span></p>
<p class=3D"MsoNormal"><span lang=3D"EN-US">&nbsp;&nbsp;&nbsp;&nbsp;&nbsp;&=
nbsp;&nbsp; &lt;webtest name=3D&quot;Test1a&quot;&gt;<o:p></o:p></span></p>
<p class=3D"MsoNormal"><span lang=3D"EN-US">&nbsp;&nbsp;&nbsp;&nbsp;&nbsp;&=
nbsp;&nbsp;&nbsp;&nbsp; &lt;invoke url=3D&quot;<a href=3D"http://www.google=
.com">http://www.google.com</a>&quot; description=3D&quot;google home&quot;=
 /&gt;<o:p></o:p></span></p>
<p class=3D"MsoNormal"><span lang=3D"EN-US">&nbsp;&nbsp;&nbsp;&nbsp;&nbsp;&=
nbsp;&nbsp;&nbsp;&nbsp; &lt;verifyText description=3D&quot;google somewhere=
&quot; text=3D&quot;google&quot; /&gt;<o:p></o:p></span></p>
<p class=3D"MsoNormal"><span lang=3D"EN-US">&nbsp;&nbsp;&nbsp;&nbsp;&nbsp;&=
nbsp;&nbsp; &lt;/webtest&gt;<o:p></o:p></span></p>
<p class=3D"MsoNormal"><span lang=3D"EN-US">&nbsp;&nbsp;&nbsp; &lt;/target&=
gt;<o:p></o:p></span></p>
<p class=3D"MsoNormal"><span lang=3D"EN-US">&lt;/project&gt;<o:p></o:p></sp=
an></p>
<p class=3D"MsoNormal"><span lang=3D"EN-US"><o:p>&nbsp;</o:p></span></p>
<p class=3D"MsoNormal"><span lang=3D"EN-US">&lt;&lt;&lt;&lt;&lt; tests/test=
1/test1.xml &lt;&lt;&lt;&lt;&lt;&lt;&lt;&lt;&lt;<o:p></o:p></span></p>
<p class=3D"MsoNormal"><span lang=3D"EN-US"><o:p>&nbsp;</o:p></span></p>
<p class=3D"MsoNormal"><span lang=3D"EN-US"><o:p>&nbsp;</o:p></span></p>
<p class=3D"MsoNormal"><span lang=3D"EN-US"><o:p>&nbsp;</o:p></span></p>
<p class=3D"MsoNormal"><span lang=3D"EN-US">&gt;&gt;&gt;&gt;&gt; Output &gt=
;&gt;&gt;&gt;&gt;&gt;&gt;&gt;&gt;<o:p></o:p></span></p>
<p class=3D"MsoNormal"><span lang=3D"EN-US">....<o:p></o:p></span></p>
<p class=3D"MsoNormal"><span lang=3D"EN-US">&nbsp; [webtest]&nbsp; INFO (co=
m.canoo.webtest.ant.WebtestTask) - Starting webtest &quot;Test1a&quot; (/wo=
rk/SampleTest/tests/test1/test1.xml:4: )<o:p></o:p></span></p>
<p class=3D"MsoNormal"><span lang=3D"EN-US">&nbsp; [webtest]&nbsp; INFO (co=
m.canoo.webtest.ant.WebtestTask) - Canoo Webtest: R_1813.<o:p></o:p></span>=
</p>
<p class=3D"MsoNormal"><span lang=3D"EN-US">...<o:p></o:p></span></p>
<p class=3D"MsoNormal"><span lang=3D"EN-US">&nbsp;&nbsp; [invoke]&nbsp; INF=
O (com.canoo.webtest.steps.Step) - &gt;&gt;&gt;&gt; Start Step: invoke &quo=
t;google home&quot; (1/2)<o:p></o:p></span></p>
<p class=3D"MsoNormal"><span lang=3D"EN-US">....<o:p></o:p></span></p>
<p class=3D"MsoNormal"><span lang=3D"EN-US">[verifyText]&nbsp; INFO (com.ca=
noo.webtest.steps.Step) - &gt;&gt;&gt;&gt; Start Step: verifyText &quot;goo=
gle somewhere&quot; (2/2)<o:p></o:p></span></p>
<p class=3D"MsoNormal"><span lang=3D"EN-US">INFO (com.canoo.webtest.ant.Web=
testTask) - Finished executing webtest &quot;Test1a&quot; (/work/SampleTest=
/tests/test1/test1.xml:4: )<o:p></o:p></span></p>
<p class=3D"MsoNormal"><span lang=3D"EN-US">INFO (com.canoo.webtest.reporti=
ng.XmlReporter) - Writing report to /work/SampleTest/results/001_Test1a/Web=
TestReport.xml<o:p></o:p></span></p>
<p class=3D"MsoNormal"><span lang=3D"EN-US">INFO (com.canoo.webtest.ant.Web=
testTask) - Test report successfully created.<o:p></o:p></span></p>
<p class=3D"MsoNormal"><span lang=3D"EN-US"><o:p>&nbsp;</o:p></span></p>
<p class=3D"MsoNormal">wt.groovyTests:<o:p></o:p></p>
<p class=3D"MsoNormal"><o:p>&nbsp;</o:p></p>
<p class=3D"MsoNormal"><span lang=3D"EN-US">wt.parallel.waitForCompletion:<=
o:p></o:p></span></p>
<p class=3D"MsoNormal"><span lang=3D"EN-US"><o:p>&nbsp;</o:p></span></p>
<p class=3D"MsoNormal"><span lang=3D"EN-US">wt.htmlReports.init:<o:p></o:p>=
</span></p>
<p class=3D"MsoNormal"><span lang=3D"EN-US">&nbsp;&nbsp;&nbsp; [mkdir] Crea=
ted dir: /work/SampleTest/results/resources<o:p></o:p></span></p>
<p class=3D"MsoNormal"><span lang=3D"EN-US">&nbsp;&nbsp;&nbsp;&nbsp; [echo]=
 Formatting /work/SampleTest/results/001_Test1a/WebTestReport.xml to HTML i=
n folder /work/SampleTest/results/001_Test1a<o:p></o:p></span></p>
<p class=3D"MsoNormal"><span lang=3D"EN-US">&nbsp;&nbsp;&nbsp;&nbsp; [copy]=
 Copying 22 files to /work/SampleTest/results/resources<o:p></o:p></span></=
p>
<p class=3D"MsoNormal"><span lang=3D"EN-US">&nbsp;&nbsp;&nbsp;&nbsp; [xslt]=
 Processing /work/SampleTest/results/001_Test1a/WebTestReport.xml to /work/=
SampleTest/results/001_Test1a/WebTestReport.html<o:p></o:p></span></p>
<p class=3D"MsoNormal"><span lang=3D"EN-US">&nbsp;&nbsp;&nbsp;&nbsp; [xslt]=
 Loading stylesheet /work/SampleTest/tests/${wt.htmlReports.xslt}<o:p></o:p=
></span></p>
<p class=3D"MsoNormal"><span lang=3D"EN-US">&nbsp;&nbsp;&nbsp;&nbsp; [xslt]=
 Failed to process /work/SampleTest/results/001_Test1a/WebTestReport.xml<o:=
p></o:p></span></p>
<p class=3D"MsoNormal"><span lang=3D"EN-US">&nbsp;&nbsp;&nbsp;&nbsp; [copy]=
 Copying 1 file to /work/SampleTest/results<o:p></o:p></span></p>
<p class=3D"MsoNormal"><span lang=3D"EN-US"><o:p>&nbsp;</o:p></span></p>
<p class=3D"MsoNormal"><span lang=3D"EN-US">wt.htmlReports:<o:p></o:p></spa=
n></p>
<p class=3D"MsoNormal"><span lang=3D"EN-US">&nbsp;&nbsp;&nbsp;&nbsp; [echo]=
 Waiting for completion of background generation of single reports<o:p></o:=
p></span></p>
<p class=3D"MsoNormal"><span lang=3D"EN-US">[groovyScript] ERROR (com.canoo=
.webtest.reporting.HTMLReportGenerator) - Error formatting /work/SampleTest=
/results/001_Test1a/WebTestReport.xml done<o:p></o:p></span></p>
<p class=3D"MsoNormal"><span lang=3D"EN-US">[groovyScript] : The following =
error occurred while executing this line:<o:p></o:p></span></p>
<p class=3D"MsoNormal"><span lang=3D"EN-US">[groovyScript] /work/canoo_webt=
est/webtest.xml:279: java.io.FileNotFoundException: /work/SampleTest/tests/=
${wt.htmlReports.xslt} (No such file or directory)<o:p></o:p></span></p>
<p class=3D"MsoNormal"><span lang=3D"EN-US">[groovyScript] &nbsp; at org.ap=
ache.tools.ant.ProjectHelper.addLocationToBuildException(ProjectHelper.java=
:541)<o:p></o:p></span></p>
<p class=3D"MsoNormal"><span lang=3D"EN-US">[groovyScript] &nbsp; at org.ap=
ache.tools.ant.taskdefs.MacroInstance.execute(MacroInstance.java:394)<o:p><=
/o:p></span></p>
<p class=3D"MsoNormal"><span lang=3D"EN-US">[groovyScript] &nbsp; at sun.re=
flect.NativeMethodAccessorImpl.invoke0(Native Method)<o:p></o:p></span></p>
<p class=3D"MsoNormal"><span lang=3D"EN-US">....<o:p></o:p></span></p>
<p class=3D"MsoNormal"><span lang=3D"EN-US">[groovyScript] Caused by: /work=
/canoo_webtest/webtest.xml:279: java.io.FileNotFoundException: /work/Sample=
Test/tests/${wt.htmlReports.xslt} (No such file or directory)<o:p></o:p></s=
pan></p>
<p class=3D"MsoNormal"><span lang=3D"EN-US">[groovyScript] &nbsp; at org.ap=
ache.tools.ant.taskdefs.XSLTProcess.process(XSLTProcess.java:720)<o:p></o:p=
></span></p>
<p class=3D"MsoNormal"><span lang=3D"EN-US">[groovyScript] &nbsp; at org.ap=
ache.tools.ant.taskdefs.XSLTProcess.execute(XSLTProcess.java:333)<o:p></o:p=
></span></p>
<p class=3D"MsoNormal"><span lang=3D"EN-US">[groovyScript] &nbsp; at org.ap=
ache.tools.ant.UnknownElement.execute(UnknownElement.java:288)<o:p></o:p></=
span></p>
<p class=3D"MsoNormal"><span lang=3D"EN-US">....<o:p></o:p></span></p>
<p class=3D"MsoNormal"><span lang=3D"EN-US">&nbsp;&nbsp;&nbsp;&nbsp; [echo]=
 Generating WebTestOverview<o:p></o:p></span></p>
<p class=3D"MsoNormal"><span lang=3D"EN-US">[groovyScript]&nbsp; WARN (com.=
gargoylesoftware.htmlunit.IncorrectnessListenerImpl) - Obsolete content typ=
e encountered: 'text/javascript'.<o:p></o:p></span></p>
<p class=3D"MsoNormal"><span lang=3D"EN-US"><o:p>&nbsp;</o:p></span></p>
<p class=3D"MsoNormal"><span lang=3D"EN-US">wt.openResultFile.init:<o:p></o=
:p></span></p>
<p class=3D"MsoNormal"><span lang=3D"EN-US"><o:p>&nbsp;</o:p></span></p>
<p class=3D"MsoNormal"><span lang=3D"EN-US">wt.openResultFile:<o:p></o:p></=
span></p>
<p class=3D"MsoNormal"><span lang=3D"EN-US">&nbsp;&nbsp;&nbsp;&nbsp; [echo]=
 Opening result file /work/SampleTest/results/index.html with firefox<o:p><=
/o:p></span></p>
<p class=3D"MsoNormal"><span lang=3D"EN-US"><o:p>&nbsp;</o:p></span></p>
<p class=3D"MsoNormal"><span lang=3D"EN-US">wt.junitLikeReports:<o:p></o:p>=
</span></p>
<p class=3D"MsoNormal"><span lang=3D"EN-US"><o:p>&nbsp;</o:p></span></p>
<p class=3D"MsoNormal"><span lang=3D"EN-US">BUILD FAILED<o:p></o:p></span><=
/p>
<p class=3D"MsoNormal"><span lang=3D"EN-US">/work/canoo_webtest/webtest.xml=
:444: input file /work/SampleTest/results/WebTestOverview.xml does not exis=
t<o:p></o:p></span></p>
<p class=3D"MsoNormal"><span lang=3D"EN-US"><o:p>&nbsp;</o:p></span></p>
<p class=3D"MsoNormal">&lt;&lt;&lt;&lt;&lt; Output &lt;&lt;&lt;&lt;&lt;&lt;=
&lt;&lt;&lt;<o:p></o:p></p>
<p class=3D"MsoNormal"><o:p>&nbsp;</o:p></p>
<p class=3D"MsoNormal">Ant version: 1.7.0<o:p></o:p></p>
<p class=3D"MsoNormal">Java version: 1.6.0_18<o:p></o:p></p>
<p class=3D"MsoNormal">Webtest: 3.0<o:p></o:p></p>
</div>
</body>
</html>

--_000_5E0C17D7E91A054AA7D623AE476FF34B937BB6ZRHEX021adszuehlk_--